The CWRC Ontology
ctb: Constance Crompton
ctb: Members of the Orlando Project
fnd: Social Sciences and Humanities Research Council
pdr: Susan Brown
creator: Abigel Lemak
creator: Alliyya Mo
creator: Colin Faulkner
creator: Deborah Stacey
creator: Jade Penancier
creator: Joel Cummings
creator: John Simpson
creator: Kim Martin
creator: Robert Warren
creator: Susan Brown
date: 2018-02-22
description: L'Ontologie CWRC est l'ontologie du Collaboratoire scientifique des écrits du Canada. @fr
description: The CWRC Ontology is the ontology of the Canadian Writing Research Collaboratory.
publisher: The Canadian Writing Research Collaboratory
rights: https://creativecommons.org/licenses/by/3.0/
subject: sh2009007122
subject: sh85013838
subject: sh85019388
subject: sh85043777
subject: sh85077519
title: L'Ontologie CWRC @fr
preferred namespace prefix: cwrc
preferred namespace uri: http://sparql.cwrc.ca/ontologies/cwrc#
in dataset: The CWRC Ontology
type: Vocabulary
type: Ontology
prior version: cwrc-2017-08-06
version info: 0.99.6
term status: Testing

Abigel Lemak
type: Person

actor
in dataset: The CWRC Ontology
type: role
type: Concept
definition: A person performing a certain role within an event.
in scheme: role

address
in dataset: The CWRC Ontology
type: Class
type: Concept
label: adresse @fr
subclass of: place
definition: A mailing or street address.
definition: The postal address is the equivalent of a schema.org address and inherits all of the data from that vocabulary to markup a modern postal address.
definition: Une adresse postale ou de rue. @fr

after life event
in dataset: The CWRC Ontology
type: Class
type: Concept
label: nachlebensereignis @de
label: évènement posthume @fr
subclass of: Event
definition: An event whose principal is a person that is deceased. Could be used for a funeral, an influence over a living author, or the estate of a deceased person.
after: birth
after: death

Alliyya Mo
type: Person

androgynous
in dataset: The CWRC Ontology
type: gender
type: Concept
label: androgyne @fr
definition: Indicates gender ambiguity or indeterminacy, and the adoption or presentation of a blend of both masculine and feminine gender attributes and behaviour. The term is strongly associated with the nineteenth and twentieth centuries, when it was redefined by Jungian theories and later by Jungian feminist psychologists (Elizabeth Wright, 1992). Androgyny may involve cross-dressing, or appropriation of external attributes usually assigned to the supposedly opposite sex or gender. It may be understood as gender indetermination, gender neutrality, or a fairly balanced mix of male and female attributes. The term also has political significance in some feminist circles. For example, androgyny is an important feature in Virginia Woolf’s vision of writing and creative processes (Virginia Woolf, 1929).
definition: Indique l'ambiguïté ou à l’indétermination du genre, avec l’adoption ou la présentation d’une combinaison de différents attributs et comportements associés aux genres féminin et masculin. Le terme est fortement associé au 19e et au 20e siècles, lorsqu’il est redéfini par C. G. Jung et plus tard par les féministes jungiennes (Elizabeth Wright, 1992). L’androgynie implique éventuellement le travestissement, ou l’appropriation d’attributs externes traditionnellement associés au sexe opposé. Elle peut être interprétée comme un genre indéterminé, neutre ou un mélange plus ou moins équilibré d’attributs féminins et masculins. Le terme possède également une connotation politique dans certains cercles féministes. Par exemple, le thème de l’androgynie est important pour Virginia Woolf dans sa conception des processus de création et d’écriture. (Virginia Woolf, 1929). @fr
in scheme: gender

birth
in dataset: The CWRC Ontology
type: Class
type: Concept
label: geburt @de
label: naissance @fr
subclass of: Event
definition: The birth event of a person.
before: death

Boarding School
in dataset: The CWRC Ontology
type: Class
subclass of: Educational Organization
definition: A boarding school provides education for pupils who live on the premises, as opposed to a day school. The word "boarding” is used in the sense of "room and board" i.e., lodging and meals. As they have existed for many centuries, and now extend across many countries, their function and ethos varies greatly.

change set
in dataset: The CWRC Ontology
type: Class
type: Concept
type: Instant
range: note
definition: A Changeset represents changes or additions made to the ontology by ontology editors or through users where instances were affected. Change Sets will also be used to translate and contain Orlando recordInfo instances.

Co-ed School
in dataset: The CWRC Ontology
type: Class
subclass of: Educational Organization
definition: Mixed-sex education, also known as mixed-gender education, co-education or coeducation (abbreviated to co-ed or coed), is a system of education where males and females are educated together. Whereas single-sex education was more common up to the 19th century, mixed-sex education has since become standard in many cultures, particularly in Western countries. Single-sex education, however, remains prevalent in many Muslim countries. The relative merits of both systems have been the subject of debate.

Colin Faulkner
type: Person

Competency Question
in dataset: The CWRC Ontology
type: AnnotationProperty
definition: A Question that can be asked of the ontology and will be used to specify the high level requirements of the CWRC Ontology allowing decisions about structure and components to be made.

Comprehensive School
in dataset: The CWRC Ontology
type: Class
subclass of: Educational Organization
definition: A comprehensive school is a secondary school that is a state school and does not select its intake on the basis of academic achievement or aptitude, in contrast to the selective school system, where admission is restricted on the basis of selection criteria. The term is commonly used in relation to England and Wales, where comprehensive schools were introduced on an experimental basis in the 1940s and became more widespread from 1965. About 90% of British secondary school pupils now attend comprehensive schools. They correspond broadly to the public high school in the United States and Canada and to the Gesamtschule in Germany.[citation needed]

Constance Crompton
type: Person

context
in dataset: The CWRC Ontology
type: Class
type: Concept
type: Annotation
label: contexte @fr
definition: The Context class provides the discursive context for assertions in the ontology. Where the assertions have been generated from a source text, Context provides the text, or the relevant snippet of a longer text, from which they have been extracted.

cultural form
in dataset: The CWRC Ontology
type: Class
type: Concept
label: forme culturelle @fr
definition: La classe de propriétés Forme Culturelle associe des concepts et des catégories spécifiques à la formation identitaire réalisée au travers de processus culturels. De telles associations ont été adoptées par le sujet elle/lui-même ou attribuées par d’autres. Même si les formes culturelles ou les identités sociales s’articulent autour de notions communément partagées comme la caractérisation, les traditions, les croyances ou les origines, certains travaux récents ont ont montré que de telles catégories sont contingentes, provisoire et construites par des discours et des pratiques sociales complexes. Tel que Stuart Hall l’affirme, "Il semble que la question de l’identité réapparaît dans une tentative de remanier la relation entre sujets et pratiques discursives" ("Introduction"). Voir la collection éditée par Stuart Hall et Paul du Goy, Questions of Cultural Identity ((Paul du Goy and Stuart Hall, 1996). Comme ils sont de nature discursive, les concepts et les catégories de Formes Culturelles se recoupent. Un même terme peut donc apparaître sous diverses formes culturelles, reflétant le changement de contextes discursifs dans lesquels il est employé et les diverses situations d’où il provient. Chaque Forme Culturelle est d'une part liée aux autres formes culturelles ou catégories identitaires qui sont appliquées à une personne ou à d’autres individus, et est d'autre part toujours reliée aux annotations de Formation Culturelle En Contexte, soutenant que les identités sociales sont toujours considérées comme des constructions en progrès. @fr
definition: The Cultural Form class of properties associates specific concepts and categories with the process of identity formation through cultural processes. Such associations may be or have been embraced by the subject herself or himself or attributed by others. Although cultural forms or social identities circulate around the notion of characteristics, traditions, beliefs, or origins that are shared with others, recent work has stressed the contingency, provisionality, and constructedness of such categories through both complex discourses and social practices. As argued by Stuart Hall, "It seems to be in the attempt to rearticulate the relationship between subjects and discursive practices that the question of identity recurs" ("Introduction"). See Stuart Hall and Paul du Goy’s edited collection Questions of Cultural Identity (Paul du Goy and Stuart Hall, 1996). Given their highly discursive nature, the concepts and categories classed as cultural forms are understood to overlap with each other conceptually. The same word or label can therefore occur as multiple cultural forms, reflecting the shifting discursive contexts in which it has been used and the diverse situations from which it has emerged. Each specific Cultural Form is understood to interact not only with other cultural forms or identity categories applied to a person, and other instances of the form applied to other people, but also always with Cultural Formation Context annotations, which support the understanding that social identities are always constructions in progress.

cultural form context
in dataset: The CWRC Ontology
type: Class
type: Concept
label: forme culturelle en contexte @fr
subclass of: context
definition: Cultural Form Context is a significant subclass of Context. Annotations typed as Cultural Form Context provide information about and discussions of a person's social identity or subjectivity through the use of cultural form properties, which when multiple often indicate intersectional identities.
definition: Formation Culturelle En Contexte est une sous-classe de contexte importante. Les annotations entrées en tant Formation Culturelle En Contexte fournissent des renseignements et des discussions sur l’identité sociales ou la subjectivité d’une personne à travers l’utilisation des propriétés Formes Culturelles, qui lorsqu'elles sont multiples indiquent souvent des identités intersectionnelles. @fr

cultural formation
is replaced by: cultural form
in dataset: The CWRC Ontology
type: DeprecatedClass
type: Concept
comment: Deprecated in favour of class cultural form.
comment: Désapprouver en faveur de la classe forme culturelle. @fr
label: formation culturelle @fr
equivalent class: cultural form
term status: deprecated
definition: Cultural formation refers to the processes of lived social subjectivities of people and is often combined with predicates indicating the identity positions as they relate to the following discursive constructions of Class, Religion, Ethnicity, Gender, GeographicalHeritage, LinguisticAbility, NationalHeritage, NationalIdentity, PoliticalAffiliation, RaceColour, and Sexuality. These categories are not understood as transhistorical or isolated categories. Rather, they facilitate analysis of how such situationally contingent, changing, and negotiated labels are assigned to or adopted by a particular individual. The tensions endemic to practices of classification demand critical engagement and inquiry into the situatedness of particular cultural identities.

Dame School
in dataset: The CWRC Ontology
type: Class
subclass of: Educational Organization
definition: A dame school was an early form of a private elementary school in English-speaking countries. They were usually taught by women and were often located in the home of the teacher.

Day School
in dataset: The CWRC Ontology
type: Class
subclass of: Educational Organization
definition: A day school—as opposed to a boarding school—is an institution where children (or high-school age adolescents) are given educational instruction during the day, after which the students return to their homes. The term can also be used to emphasize the length of full-day programs as opposed to after-school programs, as in Jewish day school.

death
in dataset: The CWRC Ontology
type: Class
type: Concept
label: mort @fr
label: tod @de
subclass of: Event
definition: The death event of a person.
after: birth

Deborah Stacey
type: Person

Domestic education context
in dataset: The CWRC Ontology
type: Class
subclass of: Education context
definition: Education that takes place at home. For example, if a woman writer in the Victorian period was taught by her brother or a governess.

Education context
in dataset: The CWRC Ontology
type: Class
comment: This optional attribute attached to Education records the mode of education and allows us to distinguish the important material effects between a domestic and an institutional education. This attribute allows us to trace the historical developments in women's access to education, for example, the informal domestic education of women writers in the early periods versus women's entrance to post-secondary education in the twentieth century.
subclass of: context

Educational award
in dataset: The CWRC Ontology
type: Class
subclass of: Education context

Educational Organization
in dataset: The CWRC Ontology
type: Class
subclass of: Organization
definition: A school is an institution designed to provide learning spaces and learning environments for the teaching of students (or "pupils") under the direction of teachers.
definition: Une école est un établissement où l'on accueille des individus appelés « écoliers » afin que des professeurs leur dispensent un enseignement de façon collective. @fr

English
is replaced by: eng
in dataset: The CWRC Ontology
type: Concept
comment: Deprecated in favour of foreign instance eng.
comment: Désapprouver en faveur de l'instance eng. @fr
label: Anglais @fr
deprecated: true
term status: deprecated

English
is replaced by: English
in dataset: The CWRC Ontology
type: Thing
type: Concept
comment: Deprecated in favour of instance English.
comment: Désapprouver en faveur de l'instance Anglais. @fr
label: Anglais @fr
deprecated: true
term status: deprecated

English
is replaced by: English
in dataset: The CWRC Ontology
type: Thing
type: Concept
comment: Deprecated in favour of instance English.
comment: Désapprouver en faveur de l'instance Anglais. @fr
label: Anglais @fr
deprecated: true
term status: deprecated

ethnicity
in dataset: The CWRC Ontology
type: Class
type: ConceptScheme
label: ethnicité @fr
subclass of: cultural form
definition: A subclass of Cultural Form for indicating a person's ethnicity, either as self-reported or as assigned by others, with accompanying context, where present, provided by race or ethnicity context annotations. Ethnicities are groups constructed on the conception of shared national, religious, geographical, racial, or cultural backgrounds or traditions, and particular ethnicities may be denigrated, lauded, or both, depending on the context. Ethnicities are shifting, historically constituted, and interestedly deployed categories whose use must be situated contextually and which are understood here finally as discursive or representational although they have real material impacts. As Angel Oquendo writes, "Despite its long ‘materialist’ past in which it was taken to be synonymous with ‘race,’ the concept of ethnicity as used today does appear to focus on cultural rather than on physiognomic difference." (Angel R. Oquendo, "Re-imagining the Latino/a Race" in The Latino/a Condition: A Critical Reader edited by Richard Delgado, Jean Stefancic 1998). This ontology therefore does not attempt to lay out an exact, fully defined, or mutually exclusive set of ethnic categories: this is an impossibility given their shifting use and the overlap among them and with identity categories for race, geography, and nationality, as demonstrated by Noel Ignatieve in his book How the Irish Became White (1995). Those using this class and its subclasses are encouraged to consult associated race or ethnicity context annotations, if available.
definition: Cette sous-classe de Forme Culturelle indique l’ethnicité d’une personne en parallèle avec le contexte fourni par les annotations de contexte ethnique ou racial lorsqu’il est présent. Une sous-classe de Forme Culturelle, elle indique l'ethnicité d’une personne, que celle-ci soit autodéclarée ou assignée par d’autres. Les ethnies sont des groupes qui se fondent sur une le partage de traditions ou d’héritages nationaux, religieux, géographiques, raciaux ou culturels; en fonction du contexte, certaines ethnies particulières sont dénigrées, glorifiées, ou les deux à la fois. Les ethnicités changeantes, historiquement constituées, développées de façon intéressée, et dont l’usage doit être resitué en contexte, sont enfin comprises ici comme discursives et représentationnelles, même si leurs répercussions matérielles sont bien réelles. Angel Oquendo écrit que «En dépit de son long passé ‘matérialiste’ au cours duquel il était synonyme de ‘race’, le concept d'ethnicité tel qu’il est employé aujourd’hui semble être centré sur la culture plutôt que sur la différence physionomique.» (Angel R. Oquendo, «Re-imagining the Latino/a Race» in The Latino/a Condition: A Critical Reader édité par Richard Delgado, Jean Stefancic) Cette ontologie ne prétend donc pas offrir un ensemble de catégories ethniques exact, complètement défini, ou mutuellement exclusif; cela est impossible étant donné leur utilisation en changement constant et leur chevauchement mutuel ou avec d’autres catégories identitaires utilisées pour la race, la géographie ou la nationalité. Les personnes qui utilisent cette classe et ses sous-classes sont encouragées à consulter les annotations de contexte ethnique ou racial lorsqu’ils sont disponibles. @fr

racial, colour or ethnicity context
is replaced by: race or ethnicity context
subject: ethnicity
subject: race or colour
in dataset: The CWRC Ontology
type: DeprecatedClass
type: Concept
comment: Deprecated in favour of class race or ethnicity context.
comment: Désapprouver en faveur de la classe contexte ethnique ou racial. @fr
label: contexte racial, de couleur de peau ou d'ethnicité @fr
subclass of: cultural form context
equivalent class: race or ethnicity context
term status: deprecated
definition: Ethnicity Context is a significant subclass of context. It is associated with the Cultural Form subclass Ethnicity, and sometimes other intersecting Cultural Forms. Annotations typed as Ethnicity Context provide information about and discussions of a person's subjectivity with regards to their perceived or self-reported ethnicity. Ethnicity Context provides depth to more granular categorizations of a person indicated by the properties has ethnicity or has ethnicity (self reported).

Event
in dataset: The CWRC Ontology
type: Class
type: Concept
label: event
label: évènement @fr
subclass of: TemporalEntity
definition: An event that occurs in time.

performance
in dataset: The CWRC Ontology
type: Class
type: Concept
label: Event Element
label: élément d'évènement @fr
subclass of: Event
definition: An event element by an agent in an event under a specific context, be it in a role, character or responsibility.

female
in dataset: The CWRC Ontology
type: textual label
comment: Deprecated with no current equivalence.
comment: Désapprouver sans équivalence. @fr
label: femelle @fr
deprecated: true
one of: Woman/Female
one of: Female
term status: deprecated
in scheme: textual label
name: Female (Label)

fictional person
type: Class
label: personne fictive
subclass of: Person
definition: A person, broadly defined, who features in an imaginative work such as a literary work, as a character or in some other way that distinguishes the reference to them from the natural person who is being represented. In other words, there is a distinction between a simple allusion to a natural person, and the fictionalization of that person within a text or other work of art.
definition: Définie de façon large, personne figurant dans une œuvre créative telle qu'une œuvre littéraire, dans laquelle elle est un personnage ou représentée d'une façon qui diffère de la personne physique à laquelle elle renvoie. Autrement dit, il existe une différence entre la simple allusion à une natural person et la version romancée de cette personne dans un texte ou tout autre oeuvre d'art.

French
is replaced by: fre
in dataset: The CWRC Ontology
type: Concept
comment: Deprecated in favour of foreign instance fre.
comment: Désapprouver en faveur de l'instance fre. @fr
label: Français @fr
deprecated: true
term status: deprecated

gender
in dataset: The CWRC Ontology
type: Class
type: ConceptScheme
label: genre @fr
subclass of: cultural form
definition: A subclass of Cultural Form for indicating a person's gender, whether attributed or self-defined, with accompanying context, where present, provided by Gender Context annotations. Although in popular culture gender and biological sex are conflated and understood to be binary, the concept of gender stresses the relationality, constructedness, and performativity of gendered identities and gendered behaviour, whose categories are historically contingent and shifting, and the boundaries between them blurry. Simone de Beauvoir (1973) stated "One is not born, but rather becomes, a woman," a belief that has been taken up by many other theorists of gender including Judith Butler (1990). Gender studies to date has investigated the social construction of femininity more than that of masculinity. The multi-layered constructedness of gender is also underlined by Donna Haraway who understands it as a "socially, historically, and semiotically positioned difference" (Donna Haraway, 1988). Gender is understood as fluid, situational, and sometimes plural, and it is related to, though not commensurate with, sexual identity and orientation, just as it is related to but not defined by specific forms of embodiment. Rather than seeing biological sex as a pre-social or natural given, the body is understood as a site of inscription (cf. (Elizabeth Grosz, 1994)) which is also socially constructed and indeed epigenetically shaped by environmental factors (N. Katherine Hayles, 2012). As articulated by feminist neurologist Gillian Einstein, (2012)"The world writes on the body". This ontology therefore does not provide separate terms for sex as distinct from gender. Instead, it privileges terms associated with gender, recognizing that they are conventionally but not necessarily associated with sex, and that there is constant slippage between gender and sex in the way that these categories circulate through discourses, actions, and institutions. Far from indicating a universal facet of experienc…
definition: Cette sous-classe de Forme Culturelle indique le genre d’une personne, qu’il soit attribué par d’autres ou autoproclamé, accompagné du contexte fourni par les annotations de Genre Contexte lorsque celui-ci est disponible. Même si dans la culture populaire le genre et le sexe biologique sont confondus et compris comme binaires, le concept de genre souligne la dimension relationnelle, construite et performative des identités et des comportements genrés, dont les catégories sont contingentes et changent au cours de l’Histoire, sans qu’elles soient clairement délimitées. Cf Simone de Beauvoir : «On ne naît pas femme, on le devient,» et d’autres nombreuses théoriciennes du genre, dont Judith Butler en 1990 (Judith Butler, 1990). À ce jour, les études de genres se sont davantage intéressées à la construction de la féminité qu’à celle de la masculinité. Cette construction du genre à plusieurs niveaux est également soulignée par Donna Haraway qui le définit comme une «différence socialement, historiquement et sémiotiquement située» (Donna Haraway,1988). Le genre est interprété comme fluide, situationnel, parfois pluriel ainsi que lié à l’identité et l’orientation sexuelles sans leur être proportionnel, tout comme il est relié à certaines façons spécifiques de vivre et de présenter son corps, qui ne définissent pas non plus le genre. Plutôt que de voir le sexe biologique comme présocial ou un fait naturel, le corps est compris comme un lieu d’inscriptions (cf. (Elizabeth Grosz, 1994)) qui est aussi socialement construit et épigénétiquement modelé par des facteurs environnementaux (N. Katherine Hayles, 2012). Selon la formulation de la neurologiste féministe Gillian Einstein, «Le monde écrit sur le corps» (Gillian Einstein, 2012). Cette ontologie ne fournit donc pas de termes séparés pour le sexe et le genre en tant qu’entités distinctes. Au contraire, elle privilégie les termes associés au genre, en admettant qu’ils sont conventionnellement mais non nécessairement associés a… @fr

Gender Context
subject: gender
in dataset: The CWRC Ontology
type: Class
type: Concept
label: Genre En Contexte @fr
subclass of: cultural form context
definition: Gender Context is a significant subclass of context. It is associated with the Cultural Form subclass Gender, and sometimes other intersecting Cultural Forms. Annotations typed as Gender Context provide information about and discussions of a person's subjectivity with regards to their gender and gender identity. Gender Context provides depth to more granular categorizations of a person indicated through the properties has gender or has gender (self reported).
definition: Genre En Contexte est une sous-classe de contexte importante. Elle est associée à la sous-classe de Forme Culturelle Genre, et se recoupe parfois avec d’autres Formes Culturelles. Les annotations entrées en tant que Genre En Contexte fournissent des renseignements et des discussions sur la subjectivité d’une personne en ce qui concerne son genre et son identité genrée. Genre Contexte explore plus en détails les indications granulaires des propriétés est de genre ou est de genre (autodéclaré). @fr

genderqueer
in dataset: The CWRC Ontology
type: gender
type: Thing
type: Concept
label: non-binaire @fr
broader: queer identity
definition: Indicates refusal of dominant gender categories and cisnormativity, and identification with both, a combination, or neither of the dominant binary gender roles. The term is strongly associated with the late twentieth and twenty-first centuries. It comes from deconstructionist and post-structuralist theory, and was coined by Teresa de Lauretis at a conference in 1990. Because "queer" identity is recent, its definition is still debated among scholars and activists. Even though it is not rigidly defined, the term is increasingly deployed to refer to a large category of people who are not "straight", in a sense that is not restricted to sexual orientation. Following Judith Butler, queerness is not understood as an essence, but best described as a doing or performance, a way to situate oneself deliberately against traditional notions of gender. See Genderqueer - Wikipedia.
definition: Indique le refus des catégories genrées dominantes et de la cisnormativité, l’identification aux deux, à aucun, ou à une combinaison des rôles genrés dominants. Le terme est fortement associé associé à la fin du 20e siècle et au 21e siècle. Il provient des théories déconstructionnistes et poststructuralistes, et fut formulé pour la première fois par Teresa de Lauretis lors d'une conférence en 1990. Du fait que le terme «queer» est assez récent, il est toujours sujet à des discussions parmi les chercheurs et les activistes. Même s’il ne possède pas de définition définitive, le terme est de plus en plus utilisé pour référer à une large catégorie de personnes qui ne sont pas «hétérosexuel/les», dans un sens qui va au-delà de l’orientation sexuelle. Selon Judith Butler, l’identité queer ne peut pas être compris comme une essence, mais est plutôt performative et s’actualise à travers des actions, au sein d’une posture délibérément à contre-courant des acceptions traditionnelles du genre. Voir See Non-binaire — Wikipédia. @fr
in scheme: gender
note: Listed as non-binary? in french

geographic heritage
in dataset: The CWRC Ontology
type: Class
type: ConceptScheme
label: héritage géographique @fr
subclass of: cultural form
definition: A subclass of cultural form, this property indicates a person's geographic heritage, with accompanying context, where present, provided by nationality context annotations. Geographic heritage involves the geographical origins of a person's family, which often contributes to an understanding of their racial and ethnic background. It offers a way to capture individuals identified as "South-Asian," for example, when no more precise national heritage is indicated. See race or ethnicity context for a detailed description of the complexities of this class. It can be multiple and it can be different from a person’s national identity or national heritage, current or official citizenship, or the geographical region or territory in which a person resides. Those using this class and its subclasses are encouraged to consult associated nationality context excerpts or annotations, if available.
definition: Une sous-classe de forme culturelle, Héritage Géographique indique l’héritage géographique d’une personne, accompagné du contexte fourni par contexte national lorsqu'il est disponible. L’héritage géographique inclut les origines géographiques de la famille du sujet, souvent utiles à la compréhension de son milieu ethnique et raciale. Cela permet par exemple de saisir l’identité des femmes qui se déclarent «sud-asiatiques», alors que nous n'en savons pas plus sur leur héritage national. Voir contexte ethnique ou racial pour un compte-rendu détaillé de la complexité de cette classe. L'héritage géographique peut être pluriel et peut différer de l’identité ou de l’héritage national, de la citoyenneté actuelle ou officielle, et de la région géographique ou du lieu de résidence. Les personnes qui utilisent cette classe et ses sous-classes sont encouragées à consulter les extraits ou les annotations de contexte national lorsqu’ils sont disponibles. @fr

Grammar School
in dataset: The CWRC Ontology
type: Class
subclass of: Educational Organization
definition: A grammar school is one of several different types of school in the history of education in the United Kingdom and other English-speaking countries, originally a school teaching Latin, but more recently an academically-oriented secondary school, differentiated in recent years from less academic Secondary Modern Schools.

Institutional education context
in dataset: The CWRC Ontology
type: Class
subclass of: Education context
definition: Education or learning that takes place in an institutional setting.
related: School

Jade Penancier
type: Person

Jewish
is replaced by: Jew
in dataset: The CWRC Ontology
comment: Deprecated in favour of instance Jewish.
comment: Désapprouver en faveur de l'instance Juif. @fr
label: Juif @fr
deprecated: true
term status: deprecated
broader: Jewish
name: Jewish (Ethnicity)

Joel Cummings
type: Person

John Simpson
type: Person

Kim Martin
type: Person

language
in dataset: The CWRC Ontology
type: Class
type: Concept
label: langue @fr
subclass of: cultural form
definition: These terms do not differentiate between spoken and/or written. For operational reasons this class is a direct equivalent to ISO639 language code as published by the Library of Congress.
definition: Écrit ou Parlé. Pour des raisons opérationnelles, cette classe est équivalente à la classe de langage iso639 publiée par la Library of Congress. @fr

language context
is replaced by: cultural form context
subject: language
subject: linguistic ability (spoken and/or writen)
in dataset: The CWRC Ontology
type: DeprecatedClass
type: Concept
comment: Deprecated in favour of class cultural form context.
comment: Désapprouver en faveur de la classe forme culturelle en contexte. @fr
label: contexte linguistique @fr
subclass of: cultural form context
equivalent class: cultural form context
term status: deprecated
definition: Language Context is a significant subclass of context. Annotations typed as Cultural Formation Context provide information about and discussions of a person's linguistic ability or abilities. Language Context provides depth to more granular indications of linguistic ability indicated through the property Language.
definition: Langue en Contexte est une sous-classe de contexte importante. Les annotations entrées en tant que Contexte de Formation Culturelle fournissent des informations et des discussions sur la ou les aptitudes linguistiques d’une personne. Langue en Contexte fournit de la profondeur aux indications granulaires sur les aptitudes linguistiques grâce à la propriété Langage. @fr

life event
in dataset: The CWRC Ontology
type: Class
type: Concept
label: lebensereignis @de
label: évènement au cours de la vie @fr
subclass of: Event
definition: An event during the life of a person.
after: birth
before: death

linguistic ability (spoken and/or writen)
in dataset: The CWRC Ontology
type: Class
type: Concept
label: aptitude linguistique (écrit ou parlé) @fr
subclass of: cultural form
definition: Describes a person's proficiency in a language (speaking, reading, or writing).

national heritage
in dataset: The CWRC Ontology
type: Class
type: ConceptScheme
label: héritage national @fr
subclass of: cultural form
definition: A subclass of Cultural Form, this property indicates a person's national heritage, with accompanying context, where present, provided by nationality context annotations. National Heritage is composed of various elements related to national identity, often transmitted from previous generations and influenced by a subject’s national historical background or geographic heritage. It can be multiple and can be different from a person’s national identity, current or official citizenship, or the geographical region or territory in which a person resides. Those using this class and its subclasses are encouraged to consult associated nationality context excerpts or annotations, if available.
definition: Une sous-catégorie de Forme Culturelle, cette propriété indique l’héritage national d’une personne, accompagné du contexte national lorsqu'il est disponible. Héritage National est composé de divers éléments relatifs à l’identité nationale, et est souvent transmis par des générations antérieures, influencé par le milieu historique et l’héritage géographique. Il peut être puluriel et peut se distinguer de l’identité nationale, de la citoyenneté actuelle ou officielle, de la région géographique ou du territoire de résidence. Les personnes qui utilisent cette classe et ses sous-classes sont encouragées à consulter les extraits ou les annotations de contexte national lorsque ceux-ci sont disponibles. @fr

nationality
in dataset: The CWRC Ontology
type: Class
type: ConceptScheme
label: nationalité @fr
subclass of: cultural form
definition: A subclass of Cultural Form, this property indicates a person's nationality, either as self-reported or as assigned by others, with accompanying context, where present,provided by nationality context annotations. It is neither the same as citizenship nor commensurate with the geographical region or territory in which a person resides. Like other identity categories, nationality may be plural, fluid, or contingent, and it can intersect with national heritage or geographic heritage as well as other identity categories. Those using this class and its subclasses are encouraged to consult associated nationality context annotations, if available.
definition: Une sous-catégorie de Forme Culturelle, cette propriété indique la nationalité d’une personne, accompagnée du contexte fourni par les annotations de contexte national lorsqu'il est disponible. Elle diffère de la citoyenneté et n’est pas proportionnelle à la zone géographique ou au lieu de résidence. Comme d’autres catégories identitaires, la nationalité peut être plurielle, fluide ou contingente, et recoupe avec héritage national ainsi qu’avec d’autres catégories identitaires. Les personnes qui utilisent cette classe et ses sous-classes sont encouragées à consulter les annotations de contexte national lorsqu’elles sont disponibles. @fr

nationality context
subject: GeographicHeritage
subject: national heritage
subject: nationality
in dataset: The CWRC Ontology
type: Class
type: Concept
label: contexte national @fr
subclass of: cultural form context
definition: Contexte National est une sous-classe de contexte importante. Les annotations entrées en tant que Contexte National fournissent des informations et des discussions sur la formation culturelle d’une personne, en lien avec son identité nationale, son héritage national et son héritage géographique qui ne sont pas toujours équivalents. Contexte National explore plus en détails les indications granulaires sur l’identité nationale à travers les propriétés Nationalité, Héritage National et Héritage Géographique. @fr
definition: Nationality Context is a significant subclass of context. Annotations typed as Nationality Context provide information about and discussions of a person's cultural formation in relation to their national identity, national heritage, and geographic heritage -- which are not always aligned. Nationality Context provides depth to more granular indications of national identity through the nationality, National Heritage, and Geographic Heritage properties.

natural person
type: Class
label: personne physique @fr
subclass of: Person
definition: Être humain en vie ou ayant vécu à un moment donné. Les personnes physiques peuvent être objets de fiction, auquel cas elles sont classées en tant que . @fr
definition: A human being who is alive, or was alive at some point in time. Natural persons may be fictionalized, in which case they are also classed as a fictional person.

performance
is replaced by: hasElement
in dataset: The CWRC Ontology
type: DeprecatedClass
type: Concept
comment: Deprecated in favour of class Event Element.
comment: Désapprouver en faveur de la classe élément d'évènement. @fr
label: Leistung @de
label: interprétation @fr
subclass of: performance
deprecated: true
equivalent class: performance
term status: deprecated
definition: A performance by an agent in an event under a specific context, be it in a role, character or responsibility.

persona
in dataset: The CWRC Ontology
type: Class
type: Concept
subclass of: Person
definition: The persona, unlike the role, cannot be adopted by people generally, but is specific to one natural person, or more rarely several natural persons. The persona is an original creation, often bearing meaning about the biographical, historical and sociological context to which its/their creator/s is/are attached. It is also important to recall that the persona cannot be associated with mental illness or multiple personality disorders, since they are not the product of a distorted or uncontrolled perception of reality. At the heart of a persona is an identity that is interacted with by others and that at times can be confused with an actual natural person. It is incarnated and developed by a natural person, and may have a social, literary, artistic or political activity.

place
in dataset: The CWRC Ontology
type: Class
type: Concept
label: endroit @fr
subclass of: SpatialThing
equivalent class: Place
equivalent class: Feature
definition: A named place, whether incorporated, settled, or occupied.
definition: Il peut concerner un endroit peuplé, mais pas nécessairemment. Certains endroits, comme les intersections, n'ont pas de de populations ou d'habitants en soi. Les Geonames classifieront parfois les endroits désormais abandonnés comme «lieux habités». @fr
definition: It may be, but is not necessarily, a populated place. Some places, such as cross-roads, do not have a population or settlement per se. Geonames will sometimes categorize places that are now abandoned as "populated places".
definition: Un endroit nommé, qu'il soit déclaré, peuplé ou occupé. @fr
name: Endroit @fr
name: Place

political affiliation
in dataset: The CWRC Ontology
type: Class
type: ConceptScheme
label: affiliation politique @fr
subclass of: cultural form
definition: This subclass of CulturalForm tracks the affiliations, connections and associations which designate a person's political involvement. These affiliations can be both formal connections to a party or organisation and informal political positions held by the writer. We hope to point our readers towards women writers associated with different political positions and help researchers make links between political beliefs and writing. For this reason, we are defining political affiliations broadly and include things like "against capital punishment" or "strong supporter of the Empire" in addition to more straightforward affiliations such as "marxist" or "conservative."
definition: Une sous-classe de Forme Culturelle, Affiliation Politique indique l’engagement politiques d’une personne ainsi que les connexions, les associations et les opinions qui y sont liées. Les affiliations renvoient à la fois aux connexions formelles avec un parti ou une organisation —telle que l’adhésion au parti— et aux autres partis pris politiques informels du sujet. Les affiliations politiques peuvent être multiple, parfois contradictoires ou en tension, et peuvent changer au cours du temps. @fr

political context
subject: political affiliation
in dataset: The CWRC Ontology
type: Class
type: Concept
label: contexte politique @fr
subclass of: cultural form context
definition: Political Context is a significant subclass of context. It is associated with the Cultural Form subclass Ethnicity, and sometimes other intersecting Cultural Forms. Annotations typed as Political Context provide information about and discussions of a person's subjectivity with regards to their political identity. Political Context provides depth to more granular categorizations of a person indicated by the properties has political affiliation and has political affiliation (self reported).

Post-Secondary School
in dataset: The CWRC Ontology
type: Class
subclass of: Educational Organization
definition: Higher education, post-secondary education, or third level education is an optional final stage of formal learning that occurs after completion of secondary education. Often delivered at universities, academies, colleges, seminaries, conservatories, and institutes of technology, higher education is also available through certain college-level institutions, including vocational schools, trade schools, and other career colleges that award academic degrees or professional certifications. Tertiary education at non-degree level is sometimes referred to as further education or continuing education as distinct from higher education. The right of access to higher education is mentioned in a number of international human rights instruments. The UN International Covenant on Economic, Social and Cultural Rights of 1966 declares, in Article 13, that "higher education shall be made equally accessible to all, on the basis of capacity, by every appropriate means, and in particular by the progressive introduction of free education". In Europe, Article 2 of the First Protocol to the European Convention on Human Rights, adopted in 1950, obliges all signatory parties to guarantee the right to education.

Prep School
in dataset: The CWRC Ontology
type: Class
subclass of: Educational Organization

Primary School
in dataset: The CWRC Ontology
type: Class
subclass of: Educational Organization
definition: A primary school (or elementary school in American English and often in Canadian English) is a school in which children receive primary or elementary education from the age of about five to twelve, coming after preschool and before secondary school. (In some countries there is an intermediate stage of middle school between primary and secondary education.)

Private School
in dataset: The CWRC Ontology
type: Class
subclass of: Educational Organization
definition: Private schools, also known as independent schools, non-governmental, or nonstate schools,[1] are not administered by local, state or national governments; thus, they retain the right to select their students and are funded in whole or in part by charging their students tuition, rather than relying on mandatory taxation through public (government) funding; at some private schools students may be able to get a scholarship, lowering this tuition fee, dependent on a student's talents or abilities (e.g. sport scholarship, art scholarship, academic scholarship), need for financial aid, or tax credit scholarships that might be available.

race or colour
in dataset: The CWRC Ontology
type: Class
type: ConceptScheme
label: race ou couleur @fr
subclass of: cultural form
definition: A subclass of Cultural Form, this property indicates a person's race or colour, often as presumed, perceived, or otherwise assigned according to cultural conventions, with accompanying context, where present, provided by race or ethnicity context annotations. Despite the ways in which categories of race or colour frequently serve heinous interests, their ideological and material impacts in the formation of identities requires recognition. These are shifting, historically constituted, and interestedly deployed categories whose use must be situated contextually and which are understood here finally as discursive or representational although they have real material impacts. They are thus as social constructs: "There is nothing more to being, or not being, a given race than the social acceptance and societal ascription of a race to a person" (Damon Sajnani, 2015). This ontology therefore does not attempt to lay out an exact, fully defined, or mutually exclusive set of racial categories: this is an impossibility given their shifting use and the overlap among them and with identity categories for ethnicity, geography, and nationality. Those applying this class and its subclasses are encouraged not to let privileged identities operate as an unspoken given or to use this class solely in relation to the marginalized. Those concerned about "white" and "black" as homogenizing categories are encouraged to reach for specificity through plural categories and representations of intersectionality, and to consult race or ethnicity context annotations, if available.
definition: Sous-classe de Forme Culturelle, cette propriété indique l’appartenance raciale ou la couleur d’une personne, souvent telle qu’elle est présupposée, perçue ou autrement assignée selon des conventions culturelles, en parallèle avec le contexte fourni par les annotation de Race ou Ethnicité lorsqu’il est présent. Même si les catégories de race ou de couleur sont fréquemment manipulées au service d'intérêts déplorables, leurs répercussions idéologiques et matérielles sur la formation identitaire requiert qu'on les prenne en compte. Ces catégories changeantes, historiquement constituées, développées de façon intéressée, et dont l’usage doit être resitué en contexte sont enfin comprises ici comme discursives et représentationnelles, même si leurs répercussions matérielles sont bien réelles. Ce sont donc des constructions sociales: «Le fait d’appartenir ou non à une race donnée n’est rien de plus que l’acceptation sociale et l’attribution sociétale d’une race à une personne» (Damon Sajnani, 2015). Cette ontologie ne prétend donc pas offrir un ensemble de catégories raciales exact, complètement défini, ou mutuellement exclusif, ce qui est impossible étant donné leur utilisation en changement constant et leur chevauchement mutuel ou avec d’autres catégories identitaires utilisées pour l’ethnicité, la géographie ou la nationalité. Les personnes qui appliquent ces catégories et sous-catégories sont encouragées à ne pas faire fonctionner les identités privilégiées comme si elles étaient consensuelles et évidentes, ou à utiliser cette classe seulement en relation avec des populations marginalisées. Les personnes préoccupées par le fait que «blanc» et «noir» sont des catégories homogénéisantes sont encouragées à atteindre la spécificité à travers la pluralité des catégories et les représentations intersectionnelles, ainsi qu’à consulter les annotations associés à contexte ethnique ou racial s’ils sont fournis. @fr

race or ethnicity
in dataset: The CWRC Ontology
type: Class
type: Concept
label: race ou ethnicité @fr
subclass of: cultural form

race or ethnicity context
subject: ethnicity
subject: race or colour
in dataset: The CWRC Ontology
type: Class
type: Concept
label: contexte ethnique ou racial @fr
subclass of: cultural form context
definition: Contexte Ethnique ou Racial est une sous-classe importante de Contexte, et est associée aux sous-classes Race ou Couleur et Ethnicité. Les annotations entrées en tant que Contexte Ethnique ou Racial fournissent des renseignements de contextualisation et des discussions sur l’identité d’un sujet concernant son appartenance raciale et/ou son ethnicité. Même si les catégories de race et d'ethnicité sont fréquemment manipulées au service d'intérêts déplorables, leurs répercussions idéologiques et matérielles sur la formation identitaire requièrent qu'on les prenne en compte. Ces catégories sont changeantes, historiquement constituées, développées de façon intéressée, et leur usage doit être resitué dans leur contexte; elles sont finalement comprises ici comme discursives et représentationnelles, même si elles ont de réelles répercussions matérielles. Elles sont entendues comme des constructions sociales: «Le fait d’être ou de ne pas être d’une certaine race n’est rien de plus que l’acceptation sociale et l’attribution sociétale d’une race à une personne» (Damon Sajnani, 2015) @fr
definition: Race or Ethnicity Context is a subclass of cultural form context, and is associated with the Cultural Form subclasses Race or Colour and ethnicity, and sometimes other cultural forms. Annotations typed as Race or Ethnicity Context provide contextualizing information about and discussions related to a person's perceived or self-reported identity with regards to race and/or ethnicity (Race or Colour or ethnicity). Despite the ways in which categories of Race or Colour and ethnicity frequently serve heinous interests, their ideological and material impacts in the formation of identities requires recognition. These are shifting, historically constituted, and interestedly deployed categories whose use must be situated contextually and are understood here finally as discursive or representational although they have real material impacts. They are thus social constructs: "There is nothing more to being, or not being, a given race than the social acceptance and societal ascription of a race to a person" (Damon Sajnani, 2015).

religion
in dataset: The CWRC Ontology
type: Class
type: ConceptScheme
subclass of: cultural form
definition: A subclass of CulturalForm, this describes a person's religion(s) or belief system(s). Note that while atheism denotes the absence of religion, we use the Religion label for convenience.
definition: Une sous-classe de Forme Culturelle, les propriétés de religion associent les sujets à une religion ou un système de croyance particulier. Les types d’affiliation et les pratiques changent au cours du temps car elles varient considérablement en fonction de la religion, de la personne et des différents contextes. Cette propriété peut inclure ou non indiquer l’adhésion formelle à une organisation religieuse associée. @fr

religious context
subject: religion
in dataset: The CWRC Ontology
type: Class
type: Concept
label: contexte religieux @fr
subclass of: cultural form context
definition: Religion Context is a significant subclass of context. It is associated with the Cultural Form subclass Religion, and sometimes other intersecting Cultural Forms. Annotations typed as Religion Context provide information about and discussions of a person's subjectivity with regards to their religion. Religion Context provides depth to more granular categorizations of a person indicated by the properties has religious affiliation or has religious affiliation (self reported).

Religious School
in dataset: The CWRC Ontology
type: Class
subclass of: Educational Organization
definition: A school associated formally in some way with a religion, ranging from parochial schools to faith-based schools.

Robert Warren
type: Person

role
in dataset: The CWRC Ontology
type: Class
definition: A role of a Person or Actor in some Event, CreativeWork, or Organisation.

Secondary Modern School
in dataset: The CWRC Ontology
type: Class
subclass of: Educational Organization
definition: A secondary modern school is a type of secondary school that once existed throughout England, Wales and Northern Ireland, from 1944 until the 1970s under the Tripartite System and still persist in Northern Ireland, where they are usually referred to simply as Secondary schools, and in areas of England, such as Buckinghamshire (where they are referred to as community schools), Lincolnshire, Wirral Medway and Kent where they are called high schools.

Secondary School
in dataset: The CWRC Ontology
type: Class
subclass of: Educational Organization
definition: A secondary school is both an organization that provides secondary education and the building where this takes place. Some secondary schools can provide both lower secondary education and upper secondary education (levels 2 and 3 of the ISCED scale), but these can also be provided in separate schools, as in the American middle school- high school system. Secondary schools typically follow on from primary schools and lead into vocational and tertiary education. Attendance is compulsory in most countries for students between the ages of 11 and 16. The organisations, buildings, and terminology are more or less unique in each country.

Secular School
in dataset: The CWRC Ontology
type: Class
subclass of: Educational Organization
definition: A school that is not formally associated with a religious organization and/or one that as avowedly secular in its educational principles, often by not always publically-funded institutions that are funded by countries with a separation between religion and the state.

Self taught education context
in dataset: The CWRC Ontology
type: Class
subclass of: Education context
definition: Education or learning conducted independently.
related: Autodidacticism

sex identity
is replaced by: gender
in dataset: The CWRC Ontology
type: DeprecatedClass
type: Concept
comment: Deprecated in favour of class Gender.
comment: Désapprouver en faveur de la classe Gender. @fr
label: identité sexe @fr
subclass of: cultural form
equivalent class: gender
term status: deprecated

Sexual Identity
is replaced by: sexuality
in dataset: The CWRC Ontology
type: DeprecatedClass
type: Concept
comment: Deprecated in favour of sexuality term.
comment: Deprecated in favour of class sexuality.
comment: Désapprouver en faveur de la classe sexualité. @fr
label: Identité Sexuelle @fr
subclass of: cultural form
equivalent class: sexuality
term status: deprecated

sexuality
in dataset: The CWRC Ontology
type: Class
type: ConceptScheme
label: sexualité @fr
subclass of: cultural form
definition: A subclass of Cultural Form and linked to Sexuality Context, Sexuality properties indicate in a word or phrase identifications or aspects of sexuality (i.e., "lesbian," "monogamous," "heterosexual" but also "promiscuous") not as a means of shutting down but advancing investigation and critical analysis of these identifications. The association assumes that sSexual identity does not function in an essentialist manner but can be plural and fluid, so multiple designations can be applied to a single person can be associated with multiple terms. Sexual identity may come from the subject her/himself or be ascribed by others. Terms may be in tension or mutually exclusive, they may reflect different life stages, and they may or may not reflect actual sexual practices. Linking a person to the term "lesbian" as a sexualityIdentity class, for instance, does not necessarily signify that the subject was in any definitive sense a lesbian; such identifications are often impossible for reasons of historical gaps and silences. As far as living persons are concerned, our practice is to draw only on widely circulated public sources or disclosures from the subject her/himself in order to avoid inadvertently outing someone. See (Campbell and Cowan, 2016)
definition: Une sous-classe de Forme Culturelle liée à Sexualité En Contexte, les propriétés de Sexualité indiquent en un mot ou en une phrase les identifications ou les aspects de la sexualité (par exemple «lesbienne», «monogame», «hétérosexuelle», mais aussi «ouverte»), non pas pour clore la discussion mais pour développer l’étude et l’analyse critique de ces catégories. Comme l’identité sexuelle peut être plurielle et fluide, une même personne est susceptible d’être associée à plusieurs termes. L’identité sexuelle peut être formulée par la personne elle-même ou être assignée par d’autres individus. Les termes utilisés peuvent se trouver en tension ou se montrer incompatibles, et reflètent différentes périodes de l’existence. Par exemple, lier une personne au terme «lesbienne» comme classe de sexualité ne signifie pas nécessairement que cette dernière était définitivement lesbienne, car une telle identification est souvent impossible à cause de lacunes et de silences historiques. En ce qui concerne les personnes toujours en vie, nous ne nous appuyons que sur des sources ou des déclarations publiques faites par le sujet elle/lui-même afin de ne pas dévoiler par inadvertance des informations privées sur sa sexualité. Voir Campbell and Cowan 2016 @fr

sexuality context
subject: gender
subject: sexuality
in dataset: The CWRC Ontology
type: Class
type: Concept
label: sexualité en contexte @fr
subclass of: cultural form context
definition: Sexuality Context is a significant subclass of context. Annotations typed as Sexuality Context provide information about and discussions of a person's subjectivity with regards to their sexuality and sexual identity. Sexuality Context provides depth to more granular categorizations of a person through the sexuality or Sexuality Self-Reported properties. It does not provide context for individual sexual experiences and relationships, although specific relationships may be invoked to indicate the impact on a subject's life and understanding of her own sexuality. Contextualizations allow recognition of the complicated politics of sexuality, for example, considerations regarding outing, the historical specificity of some categories such as "congenital invert," the appropriation of derogatory terms, and the multiplicity of constructions. There are important politics of privacy with respect to the disclosure of a subject's sexuality, sexual orientation, and sexual identity. As far as living persons are concerned, our practice is to draw only on widely circulated public sources or disclosures from the subject her/himself in order to avoid inadvertently outing someone. See (Campbell and Cowan, 2016)
definition: Sexualité En Contexte est une sous-classe de contexte importante. Les annotations de Sexualité En Contexte fournissent des renseignements et des discussions sur la sexualité et l'identité sexuelle d'une personne grâce à Sexualité ou Sexualité Autodéclarée. Elle n’est pas vouée à répertorier les expériences sexuelles et les relations intimes, même si certaines d'entre elles peuvent être évoquées pour indiquer leurs conséquences sur la vie du sujet ou la connaissance qu’elle a de sa propre sexualité. Ces efforts de contextualisation permettent de reconnaître l’existence de questions complexes qui entourent la sexualité, comme par exemple les politiques de délation, la spécificité historique de certaines catégories comme "inversion sexuelle", la réappropriation de termes dénigrants ou les mutliples constructions discursives. Il existe d'importantes politiques de confidentialité qui protègent les personnes contre la divulgation d'informations privées sur leur sexualité, leur orientation sexuelle et leur identité sexuelle. Pour les personnes toujours en vie, notre pratique est donc de ne nous appuyer que sur des sources ou des déclarations publiques venant des sujets eux-mêmes, afin de ne pas dévoiler par inadvertance des informations privées sur leur sexualité. Voir (Campbell and Cowan, 2016) @fr

Single-sex School
in dataset: The CWRC Ontology
type: Class
subclass of: Educational Organization
definition: Single-sex education, also known as single-gender education, is the practice of conducting education where male and female students attend separate classes or in separate buildings or schools. The practice was common before the twentieth century, particularly in secondary education and higher education. Single-sex education in many cultures is advocated on the basis of tradition as well as religion, and is practiced in many parts of the world. Recently, there has been a surge of interest and establishment of single-sex schools due to educational research. Single sex education is practiced in many Muslim majority countries; while in the West it is most popular in Belgium, Chile, Singapore, the United Kingdom, Hong Kong, Israel, New Zealand, Australia, South Korea. Motivations for such education range from religious ideas of sex segregation to beliefs that the sexes learn and behave differently, and, as such, they thrive in a single sex environment. In the 19th century, in Western countries, single sex girls' finishing schools, and women's colleges offered women a chance to education at a time when they were denied access to mainstream educational institutions. The former were especially common in Switzerland, the latter in the US and the UK, which were pioneers in women's education.

social class
in dataset: The CWRC Ontology
type: Class
type: ConceptScheme
label: classe sociale @fr
subclass of: cultural form
definition: A subclass of culturalForm, socialClass terms associate subjects with a specific social group, recognizing that such categories and their application to individuals are contested and can change over time. The association may be or have been embraced by the subject her/himself or attributed by others. Unlike Notes typed as socialClassContext, which contain detailed discussion of a subject's class position, socialClass links to a word or phrase signifying a particular construction of class, with particular reference to earlier historical periods in the British Isles. Social class has been variously constructed and theorized, and for women is further complicated by the fact that women were understood to take their social status from fathers and/or husbands. The terminology used here reflects quite basic social groupings that intersect with other factors such as wealth.
definition: Une sous-catégorie de culturalForm, les termes de socialClass associent les sujets à des groupes sociaux spécifiques, en prenant en compte le fait que ces catégories et leur application aux individus sont contestables et peuvent changer au fil du temps. L’association à une classe sociale peut ou a pu être assumée par le sujet elle/lui-même ou attribuée par d’autres. Contrairement aux notes comme socialClassContext, qui contiennent les détails des discussions autour de le statut social du sujet, socialClass relie un mot ou une phrase référant à une classe spécifique qui renvoie à des périodes historiques antérieures spécifiques des Îles Britanniques. La notion de classe sociale a été construite et théorisée de diverses manières, et est d’autant plus complexe pour les femmes puisqu’elles étaient censées adopter le statut social de leur père et/ou de leur mari. La terminologie ici utilisée réfère à des groupes sociaux élémentaires qui se recoupent avec d’autres facteurs comme la richesse. @fr

social class context
subject: social class
in dataset: The CWRC Ontology
type: Class
type: Concept
label: contexte social @fr
subclass of: cultural form context
definition: Contexte Social est une sous-classe de contexte importante. Les annotations entrées en tant que Contexte Social fournissent des informations et des discussions sur un sujet en lien avec sa classe sociale et parfois avec d’autres Formes Culturelles. Contexte Social explore plus en détails les indications granulaires sur l’affiliation politique à travers les propriétés de Classe Sociale.(Orlando, 2006) @fr
definition: Social Class Context is a significant subclass of context. Annotations typed as Social Class Context provide information about and discussions of a person's cultural formation in relation to social class identities and sometimes other intersecting Cultural Forms. Social Class Context provides depth to more granular indications of social class through the Social Class property(Orlando, 2006).

social class identity
is replaced by: social class
in dataset: The CWRC Ontology
type: DeprecatedClass
type: Concept
label: identité classe sociale @fr
subclass of: cultural form
equivalent class: social class
term status: deprecated
definition: A subclass of culturalForms, socialClassIdentity terms associate subjects with a specific social group, recognizing that such categories and their application to individuals are contested and can change over time. The association may be or have been embraced by the subject her/himself or attributed by others. Unlike Notes typed as socialClassContext, which contain detailed discussions of a subject's class position, socialClassIdentity links to a word or phrase signifying a particular construction of class, with particular reference to earlier historical periods in the British Isles. Social class has been variously constructed and theorized, and for women is further complicated by the fact that women were understood to take their social status from fathers and/or husbands. The terminology used here reflects quite basic social groupings that intersect with other factors such as wealth.
definition: Une sous-catégorie de culturalForms, les termes de socialClassIdentity associent les sujets à des groupes sociaux spécifiques, en prenant en compte le fait que ces catégories et leur application aux individus sont contestables et peuvent changer au fil du temps. L’association à une classe sociale peut ou a pu être assumée par le sujet elle/lui-même ou attribuée par d’autres. Contrairement aux notes comme socialClassContext, qui contiennent les détails des discussions autour de le statut social du sujet, socialClassIdentity relie un mot ou une phrase référant à une classe spécifique qui renvoie à des périodes historiques antérieures spécifiques des Îles Britanniques. La notion de classe sociale a été construite et théorisée de diverses manières, et est d’autant plus complexe pour les femmes puisqu’elles étaient censées adopter le statut social de leur père et/ou de leur mari. La terminologie ici utilisée réfère à des groupes sociaux élémentaires qui se recoupent avec d’autres facteurs comme la richesse. @fr

State School
in dataset: The CWRC Ontology
type: Class
subclass of: Educational Organization
definition: State schools (also known as public schools outside England and Wales[note 1]) are generally primary or secondary schools mandated for or offered to all children without charge, funded in whole or in part by taxation. These schools are generally inclusive (non-selective) in admitting all students within the geographical area that they serve.

Susan Brown
type: Person

textual label
in dataset: The CWRC Ontology
type: Class
type: ConceptScheme
label: étiquette @fr
subclass of: cultural form
definition: Collection of all ambiguous labels within the Orlando markup.
related: Label

Trade School
in dataset: The CWRC Ontology
type: Class
subclass of: Educational Organization
definition: A vocational school, sometimes called a trade school or vocational college, is a post-secondary educational institution designed to provide vocational education, or technical skills required to perform the tasks of a particular and specific job. Vocational schools are traditionally distinguished from four-year colleges by their focus on job-specific training to students who are typically bound for one of the skilled trades, rather than providing academic training for students pursuing careers in a professional discipline. While many schools have largely adhered to this convention, the purely vocational focus of other trade schools began to shift in the 1990s "toward a broader preparation that develops the academic" as well as technical skills of their students.

abolition
in dataset: The CWRC Ontology
contrary to: pro-slavery
type: political affiliation
type: Concept
value: abolitionist
value: anti-slavery
value: integrationism
value: sugar boycotter
comment: La description de ce terme est basée sur celle de DBPedia. @fr
comment: The description for this term is indebted to DBpedia.
label: Abolitionnisme @fr
label: abolitionism
broader transitive: civil rights
broader transitive: human rights activist
broader transitive: activist for racial equality
definition: "Abolitionism is a movement to end slavery, whether formal or informal. In Western Europe and the Americas, abolitionism is a historical movement to end the African and Indian slave trade and set slaves free. King Charles I of Spain, usually known as Emperor Charles V, following the example of the Swedish monarch, passed a law which would have abolished colonial slavery in 1542, although this law was not passed in the largest colonial states, and so was not enforced. In the late 17th century, the Roman Catholic Church, taking up a plea by Lourenco da Silva de Mendouca, officially condemned the slave trade, which was affirmed vehemently by Pope Gregory XVI in 1839. An abolitionist movement only started in the late 18th century, however, when English and American Quakers began to question the morality of slavery. James Oglethorpe was among the first to articulate the Enlightenment case against slavery, banning it in the Province of Georgia on humanist grounds, arguing against it in Parliament, and eventually encouraging his friends Granville Sharp and Hannah More to vigorously pursue the cause. Soon after his death in 1785, they joined with William Wilberforce and others in forming the Clapham Sect. The Somersett Case in 1772, which emancipated a slave in England, helped launch the British movement to abolish slavery. Though anti-slavery sentiments were widespread by the late 18th century, the colonies and emerging nations that used slave labour continued to do so: French, English and Portuguese territories in the West Indies; South America; and the Southern United States. After the American Revolution established the United States, northern states, beginning with Pennsylvania in 1780, passed legislation during the next two decades abolishing slavery, sometimes by gradual emancipation. Massachusetts ratified a constitution that declared all men equal; freedom suits challenging slavery based on this principle brought an end to slavery in the state. Vermont, which exist…
definition: "L'abolitionnisme est un courant de pensée qui émerge dans le dernier tiers du XVIIIe siècle dans le monde occidental (notamment en Grande-Bretagne) et vise la suppression de l'esclavage. Par extension, on utilise le terme pour tous les mouvements qui cherchent la suppression d'une tradition, d'une institution ou d'une loi : abolition de la peine de mort, de la torture, du travail, des privilèges, des prisons, de la prostitution, du spécisme, etc." (DBpedia, 2017) @fr
in scheme: political affiliation

Abrahamic religions
in dataset: The CWRC Ontology
type: religion
type: Concept
comment: La description de ce terme est basée sur celle de DBPedia. @fr
comment: The description for this term is indebted to DBpedia.
label: Religions abrahamiques @fr
definition: "Abrahamic religions, emphasising and tracing their common origin to the tribal patriarch Abraham or recognizing a spiritual tradition identified with him, comprising one of the major divisions in comparative religion, along with Indian, Iranian, and East Asian religions. Judaism, Christianity and Islam are the largest Abrahamic religions.The largest Abrahamic religions in chronological order of founding are Judaism (2nd millennium BCE), Christianity (1st century CE) and Islam (7th century CE)." (DBpedia, 2017)
definition: "L'expression religion abrahamique désigne principalement le judaïsme, le christianisme dont les Saintes Écritures, respectivement le Tanakh, la Bible évoquent la figure d'Abraham et l'islam avec le Coran, celle d'Ibrahim.En français, cette expression est apparue vers 1950 dans des études d'islamologie pour désigner, d'une part, la religion d'Abraham telle qu'elle se conçoit dans l'islam et d'autre part les trois religions que sont le judaïsme, le christianisme et l'islam." (DBpedia, 2017) @fr
in scheme: religion

actor to
in dataset: The CWRC Ontology
type: ObjectProperty
type: Concept
domain: Agent
range: performance
inverse of: has Actor
definition: The Events that the Actor is associated with.

affected entity
in dataset: The CWRC Ontology
type: ObjectProperty
domain: change set
definition: Affected Entities link to the Object or Class that was modified within a ChangeSet, this can be any rdf:resource. A ChangeSet may have 0 to many AffectedEntities.

African-Americans
in dataset: The CWRC Ontology
type: ethnicity
type: Concept
label: African-American
label: Afro-américain @fr
broader: black identity
definition: "African Americans (also referred to as Black Americans or Afro-Americans) are an ethnic group of Americans (citizens or residents of the United States) with total or partial ancestry from any of the Black racial groups of Africa. The term may also be used to include only those individuals who are descended from enslaved Africans. As a compound adjective the term is usually hyphenated as African-American." (DBpedia, 2017)
definition: «Les Afro-Américains, également appelés Noirs américains ou, plus rarement, Africains-Américains, sont les citoyens des États-Unis ayant des ancêtres originaires d'Afrique noire. La grande majorité des Afro-Américains est descendante des esclaves déportés entre le début du xviie et le début du xixe siècle. Longtemps victimes de l'esclavage, de la ségrégation raciale et de la discrimination (en), la reconstruction après la guerre de Sécession, la déségrégation et le Mouvement des droits civiques constituent autant d'étapes vers la reconnaissance des droits des Afro-Américains. L’accession de Barack Obama à la tête des États-Unis en 2009 constitue bien d’un certain point de vue la fin de ce long cheminement mais n'empêche pas que les classes sociales afro-Américaines les plus démunies soient toujours confrontées au racisme et à la discrimination, notamment par certains membres des forces de police américaine.»(DBpedia, 2017) @fr
in scheme: ethnicity

black African descent
in dataset: The CWRC Ontology
type: ethnicity
type: Concept
label: Africain @fr
label: African
broader: black identity
definition: "The ethnic groups of Africa number in the thousands, each generally having its own language (or dialect of a language) and culture. The ethnolinguistic groups include various Afro-Asiatic, Khoisan, Niger-Congo and Nilo-Saharan populations." (DBpedia, 2017)
definition: «Cet article propose une liste des groupes ethniques d'Afrique, non exhaustive (on peut en dénombrer près de 2 000 sur le continent africain et à Madagascar) et en cours d'élaboration. Comme il s'agit de sociétés vivantes, ces distinctions et divisions sont toujours discutées et en évolution, il n'en existe donc pas de représentation unique. La notion d'ethnie est controversée au sein de l'anthropologie contemporaine, notamment francophone. En particulier, il n'existe pas d'accord sur des critères permettant de délimiter tous les groupes (langue, culture, territoire, sentiment d'appartenance…) Ce répertoire alphabétique a donc surtout une finalité pratique. Il appartient à chaque article d'apporter précisions et mise en perspective historique.»(DBpedia, 2017) @fr
in scheme: ethnicity
name: African (ethnicity)

Agnosticism
in dataset: The CWRC Ontology
type: religion
type: Concept
comment: La description de ce terme est basée sur celle de DBPedia. @fr
comment: The description for this term is indebted to DBpedia.
label: agnosticisme @fr
definition: "Agnosticism is the view that the truth values of certain claims – especially metaphysical and religious claims such as whether God, the divine or the supernatural exist – are unknown and perhaps unknowable. According to the philosopher William L. Rowe: "In the popular sense of the term, an agnostic is someone who neither believes nor disbelieves in God, whereas an atheist disbelieves in God." Agnosticism is a doctrine or set of tenets rather than a religion as such. Thomas Henry Huxley, an English biologist, coined the word "agnostic" in 1869. Earlier thinkers, however, had written works that promoted agnostic points of view, such as Sanjaya Belatthaputta, a 5th-century BCE Indian philosopher who expressed agnosticism about any afterlife; and Protagoras, a 5th-century BCE Greek philosopher who expressed agnosticism about "the gods". The Nasadiya Sukta in the Rigveda is agnostic about the origin of the universe." (DBpedia, 2017)
definition: "L’agnosticisme ou pensée de l'interrogation est une attitude de pensée considérant la vérité de certaines propositions concernant notamment l'existence de Dieu ou des dieux comme inconnaissable : à la différence des croyants, considérant probable ou certaine l'existence de telles divinités, ou des athées l'estimant improbable ou impossible, les agnostiques refusent de trancher. Si le degré de scepticisme varie selon les individus, les agnostiques s'accordent pour dire qu'il n'existe pas de preuve définitive en faveur de l'existence ou de l'inexistence du divin, et affirment l'impossibilité de se prononcer. Si les agnostiques refusent de se prononcer quant à l'existence d'une intelligence supérieure, ils n'accordent, en revanche, ou du moins tendent à n'accorder, aucune transcendance et aucune valeur sacrée aux religions (prophète, messie, textes sacrés...) et à leurs institutions (clergé, rituels et prescriptions diverses...). Ceux-ci voient en effet les religions comme de pures constructions sociales et culturelles qui auraient surtout pour fonction historique d'assurer la cohésion et l'ordre dans les sociétés humaines traditionnelles via par exemple la menace de l'enfer, la promesse du paradis ou encore la notion de péché ou par le mécanisme du bouc émissaire. En d'autres termes, les religions, aux yeux d'un agnostique, seraient bien trop «humaines» de par leurs modes de fonctionnement et de par les dynamiques anthropologiques sur lesquelles elles se basent (soutien psychologique face à la mort, analogie très anthropocentrique d'un Dieu bâtisseur de l'univers...) pour qu'elles aient un quelconque lien direct avec toute forme d'intelligence supérieure, tout en n'excluant pas non plus pour certains le fait que ce soit malgré tout possible. D'où cette interrogation constante propre à l'agnostique." (DBpedia, 2017) @fr
in scheme: religion

aids activist
in dataset: The CWRC Ontology
type: political affiliation
type: Concept
comment: The description for this term is indebted to DBpedia.
label: AIDS activism
label: lutte contre le sida @fr
broader transitive: progressivism
definition: Activism related to HIV/AIDS, ranging from addressing attitudes to changing government policies related to treatment and medication. See: Category:AIDS activism - Wikipedia
definition: Militantisme lié au sida/VIH, allant du changement des comportements aux politiques gouvernementales sur les traitements et les médicaments. Voir Mouvements des malades — Wikipédia @fr
in scheme: political affiliation

altered by
in dataset: The CWRC Ontology
type: ObjectProperty
domain: change set
range: natural person
definition: Links a person to a change set entry.

(us) nationalist
in dataset: The CWRC Ontology
type: political affiliation
type: Concept
value: american nationalist
value: us nationalist
value: us patriotism
label: American nationalism
label: nationalisme américain @fr
broader transitive: nationalism
definition: American nationalism emphasizes the distinctiveness of American language, culture, and history, and calls for a celebration of "Americanness," which might include white nationalist pride and anti-immigration.
in scheme: political affiliation

anarchist
in dataset: The CWRC Ontology
contrary to: nationalism
type: political affiliation
type: Concept
comment: La description de ce terme est basée sur celle de DBPedia. @fr
comment: The description for this term is indebted to DBpedia.
label: Anarchisme @fr
label: anarchism
definition: "Anarchism is a political philosophy that advocates self-governed societies based on voluntary institutions. These are often described as stateless societies, although several authors have defined them more specifically as institutions based on non-hierarchical free associations. Anarchism holds the state to be undesirable, unnecessary, and harmful. While anti-statism is central, anarchism entails opposing authority or hierarchical organisation in the conduct of all human relations, including, but not limited to, the state system. Anarchism does not offer a fixed body of doctrine from a single particular world view, instead fluxing and flowing as a philosophy. Many types and traditions of anarchism exist, not all of which are mutually exclusive. Anarchist schools of thought can differ fundamentally, supporting anything from extreme individualism to complete collectivism. Strains of anarchism have often been divided into the categories of social and individualist anarchism or similar dual classifications. Anarchism is usually considered a radical left-wing ideology, and much of anarchist economics and anarchist legal philosophy reflect anti-authoritarian interpretations of communism, collectivism, syndicalism, mutualism, or participatory economics." (DBpedia, 2017)
definition: L'anarchisme est un courant de philosophie politique développé depuis le XIXe siècle sur un ensemble de théories et de pratiques anti-autoritaires d'égalité sociale. Le terme libertaire, souvent utilisé comme synonyme d'anarchisme, est un néologisme créé en 1857 par Joseph Déjacque pour renforcer le caractère égalitaire. Fondé sur la négation du principe d'autorité dans l'organisation sociale et le refus de toute contrainte découlant des institutions basées sur ce principe, l'anarchisme a pour but de développer une société sans domination et sans exploitation, où les individus-producteurs coopèrent librement dans une dynamique d'autogestion et de fédéralisme. Contre l'oppression, l'anarchisme propose une société basée sur la solidarité comme solution aux antagonismes, la complémentarité de la liberté de chacun et celle de la collectivité, l'égalité des conditions de vie et la propriété commune autogérée. Il s'agit donc d'un mode politique qui cherche non pas à résoudre les différences opposant les membres constituants de la société mais à associer des forces autonomes et contradictoires. Le terme «anarchisme» et ses dérivés sont employés tantôt péjorativement, comme synonymes de désordre social dans le sens commun ou courant et qui se rapproche de l’anomie, tantôt comme un but pratique, car l'anarchisme défend l'idée que l'absence d'une structure de pouvoir n'est pas synonyme de désorganisation sociale. Les anarchistes rejettent en général la conception courante de l'anarchie (utilisée par les médias et les pouvoirs politiques). Pour eux, l'ordre naît de la liberté, tandis que les pouvoirs engendrent le désordre. Certains anarchistes useront du terme «acratie» (du grec «kratos», le pouvoir), donc littéralement «absence de pouvoir», plutôt que du terme «anarchie» qui leur semble devenu ambigu. De même, certains anarchistes auront plutôt tendance à utiliser le terme de «libertaires». Pour ses partisans, l'anarchie n'est justement pas le désordre social. C’est plutôt l… @fr
in scheme: political affiliation
related: anti-monarchist

Anglicanism
in dataset: The CWRC Ontology
type: religion
type: Concept
type: Organization
comment: La description de ce terme est basée sur celle de DBPedia. @fr
comment: The description for this term is indebted to the Getty Art & Architecture Thesaurus.
label: Anglicaans (kerk van Engeland) @nl
label: Anglicanismo @es
label: Iglesia de Inglaterra @es
label: ying guo sheng gong hui @zh-latn
label: ying kuo sheng kung hui @zh-latn
label: yīng guó shèng gōng huì @zh-latn
label: Église d'Angleterre @fr
label: 英國聖公會 (英國國教) @zh-hant
broader transitive: Christianity
definition: "A Christian denomination having both Protestant and Catholic aspects that originated with Henry VIII's break with the Roman Catholic Church (ca. 1532-34). As the official state Church of England, the monarch of England is still formally considered its head. While at first it remained mainly Catholic in character, reforms came under Edward IV and Elizabeth I who introduced doctrine that was more Protestant in nature, namely new editions of the Book of Common Prayer and the Thirty-nine Articles. Although an overall attitude of toleration exists in the modern Anglican Church, tension remains between its Protestant and Catholic inclinations as well as with newer liberal and evangelical influences. Anglicanism is based on episcopal authority and parish structure is fundamental to the organisation of the church. The term is used with regard to the Church of England; with regard to the Episcopal Church in America, use "Episcopal."" (Getty, 2017)
definition: "L'anglicanisme est une confession chrétienne présente principalement dans les pays qui ont pu être imprégnés par la culture anglaise incluant notamment, outre l'Angleterre, les anciennes colonies britanniques en Amérique et en Afrique. On retrouve tout de même plusieurs communauté anglicanes dans le monde, notamment en France. L'origine de cette confession remonte à la période antique de l'Église d'Angleterre, lorsque celle-ci était unie canoniquement et juridiquement à l'évêque de Rome. Puis, au XVIe siècle, lorsque le roi d'Angleterre Henri VIII rompit avec le pape de Rome pour causes politiques et théologiques. Ainsi, Henri VIII ne créa rien de nouveau : il extirpa l'autorité du pape de son royaume, sans pour autant modifier ou jeter de nouvelles bases théologiques pour l'Église, et remplaça l'autorité papale par la sienne propre. Depuis la reine Elizabeth Ire, le monarque a le titre de «gouverneur suprême», mais n'a qu'un rôle de maintien de l'ordre et du bon déroulement de la vie ecclésiale, mais aucune réelle autorité décisionnelle comme celle d'un évêque ou d'un synode. L'Archevêque de Canterbury porte le titre de «primat de toute l'Angleterre» et l'archevêque d'York porte quant à lui le titre de «primat de l'Angleterre». L'Église anglicane, tout comme l'Église orthodoxe, est une communion d'églises autocéphales, mais néanmoins interdépendantes. Bien que plusieurs églises anglicanes existent à travers le monde, comme c'est le cas pour l'Église catholique romaine (présente en France, en Espagne, etc.), ou encore pour l'Église orthodoxe (présente en Russie, en Serbie, etc.), il ne s'agit que d'une seule Église. Elles sont rassemblées dans la Communion anglicane , au sein de laquelle l'Église d'Angleterre et son primat, l'archevêque de Canterbury, ne jouissent que d'une primauté d'honneur. Ces églises sont en pleine communion (doctrinale, spirituelle, épiscopale, sacramentelle) les unes avec les autres et représentent ensemble environ 85 millions de fidèles. Le… @fr
definition: "Te gebruiken om te verwijzen naar de anglicaanse kerk (Church of England); gebruik 'episcopaal' om te verwijzen naar de episcopale kerk in Amerika. De term verwijst naar een christelijke geloofsrichting met zowel protestantse als katholieke elementen die ontstond na de breuk tussen de Engelse koning Hendrik VIII en de rooms-katholieke kerk (circa 1532-34). Het anglicanisme is de officiële Britse staatsgodsdienst, en de Britse soevereine vorst is nog altijd het officiële hoofd van de anglicaanse kerk. Aanvankelijk droeg de kerk nog een overwegend katholiek karakter, maar onder Edward IV en Elizabeth I werden er hervormingen doorgevoerd en werd een meer protestants georiënteerde geloofsleer geïntroduceerd, met een nieuwe versie van het Book of Common Prayer en de Negenendertig Artikelen. Hoewel de huidige anglicaanse kerk in het algemeen wordt gekenmerkt door een tolerante houding, zijn de spanningen tussen protestants en katholiek gezinde stromingen binnen de kerk nooit verdwenen en heerst er weerstand tegen nieuwe vrijzinnige en evangelische invloeden. Het anglicanisme berust op episcopaal gezag en op een structuur van parochies, welke van fundamenteel belang is voor de kerkelijke organisatie." (Getty, 2017) @nl
definition: "Úsese con referencia a la Iglesia de Inglaterra y también con referencia a la Iglesia Episcopal de Estados Unidos (úsese Iglesia Episcopal). Este término s erefiere a a una denominación cristiana que contiene elementos católicos y protestantes en varios aspectos y que se originó con el rey Enrique VIII quien rompió con la Iglesia Católica Romana (ca. 1532-1534) Es la iglesia oficial de Inglaterra, la Monarquía Inglesa es aún formalmente considerada su cabeza.Mientras en sus comienzos conservaba su carácter católico, con las reformas realizadas bajo Eduardo IV e Isabel I quienes introdujeron una doctrina que está más cerca del protestantismo y que se encuentra contenida en nuevas ediciones del Libro de Oraciones Comunes y en los Treinta y nueve Artículos. Aunque el anglicanismo tiene actualmente una actitud de total tolerancia, aún persisten tensiones con las iglesias protestantes y católicas así como de últimas influencias liberales y evangélicas.El Anglicanismo está basado en la autoridad episcopal y se sustenta en una estructura de parroquias que resulta fundamental para la organización de la Iglesia." (Getty, 2017) @es
definition: "英王亨利八世與羅馬天主教教會(西元1532-34年)分裂所創的基督教派別，同時含有新教與天主教元素。作為官方英國國教，其正式教會首腦仍為英國國王。起初較具天主教特色，在愛德華四世與伊莉莎白一世時改革，加入較具新教本質的教條，即：新版的公禱書(Book of Common Prayer)及三十九條信綱(Thirty-nine Articles)。雖然現代的英國聖公會大體上態度已越顯寬容，但教會內的新教派系與天主教派系關係仍緊繃，也仍不樂於接受較新的自由與福音派影響。英國聖公會奠基於主教的權威上，牧師教區的結構對教會組織十分重要。此詞彙用於指稱英國國教；美國區的主教派教會，則稱為「美國聖公會(Episcopal)」。" (Getty, 2017) @zh-hant
in scheme: religion

animal activist
in dataset: The CWRC Ontology
type: political affiliation
type: Concept
value: animal rights
value: animal rights advocate
value: animal welfare activist
value: anti-blood-sports
value: anti-cruelty
value: anti-cruelty to animals
value: anti-hunting
comment: The description for this term is indebted to DBpedia.
label: animal welfare advocacy
label: défense du bien-être animal @fr
broader transitive: progressivism
definition: Advocacy, often in the form of activism, for the welfare of animals. See: Animal welfare - Wikipedia
definition: Défense pour le bien-être des animaux, souvent sous forme de miliitantisme. Voir Bien-être animal — Wikipédia @fr
in scheme: political affiliation
related: activist for women and children

anti-American politics
in dataset: The CWRC Ontology
contrary to: (us) nationalist
contrary to: pro-American
type: political affiliation
type: Concept
comment: The description for this term is indebted to DBpedia.
label: anti-américanisme @fr
definition: Opposed to the policies or influence of the United States of America, often with reference to specific government actions. See: Anti-Americanism - Wikipedia
definition: Opposition aux politiques ou à l'influence des États-Unis, souvent en référence à des actions gouvernementales spécifiques. Voir: Antiaméricanisme — Wikipédia @fr
in scheme: political affiliation

anti-anti-semitism
in dataset: The CWRC Ontology
contrary to: anti-semitism
type: political affiliation
type: Concept
value: anti-antisemitic
value: anti-antisemitist
comment: The description for this term is indebted to DBpedia.
label: anti-antisemitism
label: anti-antisémitisme @fr
broader transitive: activist for racial equality
definition: Opposed to anti-semitic attitudes and practices. See Antisemitism - Wikipedia
definition: Opposition aux attitude et aux pratiques antisémitistes. Voir Antisémitisme — Wikipédia @fr
in scheme: political affiliation
related: anti-fascist

anti-apartheid
in dataset: The CWRC Ontology
type: political affiliation
type: Concept
comment: The description for this term is indebted to DBpedia.
broader transitive: human rights activist
broader transitive: activist for racial equality
broader transitive: progressivism
definition: "The Anti-Apartheid Movement (AAM), originally known as the Boycott Movement, was a British organisation that was at the centre of the international movement opposing South Africa's system of apartheid and supporting South Africa's non-whites." (DBpedia, 2017)
in scheme: political affiliation

anti-Boer politics
in dataset: The CWRC Ontology
contrary to: pro-Boer War
type: political affiliation
type: Concept
comment: The description for this term is indebted to DBpedia.
label: anti-boer @fr
definition: "Opposition to the Second Boer War in Britain was modest when the war began on 11 October 1899 and was always less widespread than support for it, let alone prevailing indifference. However, influential groups formed immediately and ineffectually against the war, including the South African Conciliation Committee and W. T. Stead's Stop the War Committee." (DBpedia, 2017)
in scheme: political affiliation
related: anti-WarMovement

anti-bolshevik
in dataset: The CWRC Ontology
contrary to: Bolshevist
type: political affiliation
type: Concept
comment: La description de ce terme est basée sur celle de DBPedia. @fr
comment: The description for this term is indebted to DBpedia.
label: Anticommunisme @fr
label: anti-Bolshevism
definition: "Anti-communism is opposition to communism. Organized anti-communism developed in reaction to the rise of communism, especially after the 1917 October Revolution in Russia. It reached global dimensions during the Cold War, when America and the Soviet Union engaged in an intense rivalry. Most modern anti-communists reject the concept of historical materialism, which is a central idea in Marxism. Anti-communists reject the Marxist belief that capitalism will be followed by socialism and communism, just as feudalism was followed by capitalism. Anti-communists question the validity of the Marxist claim that the socialist state will "wither away" when it becomes unnecessary in a true communist society. Anti-communists also accuse communists of having caused several famines that occurred in 20th-century communist states, such as the Russian Famine of 1921 and the much more severe famine in China during the Great Leap Forward. Some anti-communists refer to both communism and fascism as totalitarianism, seeing similarity between the actions of communist and fascist governments. Opponents argue that communist parties that have come to power have tended to be rigidly intolerant of political opposition. Communist governments have also been accused of creating a new ruling class (a Nomenklatura), with powers and privileges greater than those previously enjoyed by the upper classes in the non-communist regimes." (DBpedia, 2017)
definition: "Le terme d'anticommunisme englobe, au sens large, l'ensemble des attitudes d'opposition ou d'hostilité envers les aspects théoriques ou pratiques du communisme : l'anticommunisme peut se traduire sous forme de simple prise de position, de discours politique structuré, d'action ou de propagande. Son sens est cependant changeant en fonction de celui du «communisme», mot qui recouvre lui-même un ensemble de réalités très différentes les unes des autres en fonction des contextes sociaux, culturels et politiques. Les facteurs distinguant les différents types d'anticommunisme sont notamment la forme de communisme explicitement visée et les motivations qui poussent à s'opposer au communisme ; le terme «anticommunisme» est employé, selon les époques et les contextes, pour qualifier l'opposition aux théories marxistes ou communistes elles-mêmes, ou aux mouvances et partis politiques s'en réclamant, ou bien à la pratique politique des régimes communistes. Le terme d'«anticommunisme» a pu ainsi être utilisé pour qualifier les opposants au stalinisme, que ces derniers aient été ou non anticommunistes au sens strict. Apparu au XIXe siècle en tant que concept, l'anticommunisme s’est largement développé au cours du XXe siècle, à la suite de la prise du pouvoir par les bolcheviks en Russie en octobre 1917, puis à la création de l’URSS : il s’est alors identifié, pour l'essentiel, à l'opposition aux régimes communistes et aux partis communistes d'inspiration léniniste et stalinienne. Après la Seconde Guerre mondiale, l’anticommunisme devient un élément majeur de la politique étrangère et intérieure des États-Unis, opposés à l'URSS dans le contexte de la guerre froide." (DBpedia, 2017) @fr
in scheme: political affiliation
related: anti-communist

anti-bonapartist
in dataset: The CWRC Ontology
contrary to: pro-bonapartist
type: political affiliation
type: Concept
comment: The description for this term is indebted to DBpedia.
label: anti-Bonapartism
label: anti-bonapartisme @fr
definition: Opposed to the political ideology of Napolean Bonaparte and his followers. See Bonapartism - Wikipedia
definition: Opposition à la politique et aux idées de Napoléon Bonaparte et ses parisans. Voir Bonapartisme — Wikipédia @fr
in scheme: political affiliation

anti-British politics
in dataset: The CWRC Ontology
type: political affiliation
type: Concept
comment: The description for this term is indebted to DBpedia.
label: anglophobie @fr
definition: Opposed to the policies or influence of the United Kingdom, often with reference to specific government actions. See: Anti-British sentiment - Wikipedia
definition: Opposition aux politiques ou à l'influence du Royaume-Uni, souvent en référence à des actions gouvernementales spécifiques. Voir Anglophobie — Wikipédia @fr
in scheme: political affiliation

anti-capital-punishment
in dataset: The CWRC Ontology
type: political affiliation
type: Concept
value: opponent of capital punishment
comment: La description de ce terme est basée sur celle de DBPedia. @fr
comment: The description for this term is indebted to DBpedia.
label: Peine de mort @fr
label: anti-capital punishment
broader transitive: progressivism
definition: "Capital punishment, also known as the death penalty, is a government sanctioned practice whereby a person is put to death by the state as a punishment for a crime. The sentence that someone be punished in such a manner is referred to as a death sentence, whereas the act of carrying out the sentence is known as an execution. Crimes that can result in a death penalty are known as capital crimes or capital offences. The term capital is derived from the Latin capitalis ("of the head", referring to execution by beheading). Fifty-eight countries retain capital punishment, 102 countries have completely abolished it de jure for all crimes, six have abolished it for ordinary crimes (while maintaining it for special circumstances such as war crimes), and 32 are abolitionist in practice. Capital punishment is a matter of active controversy in various countries and states, and positions can vary within a single political ideology or cultural region. In the European Union, Article 2 of the Charter of Fundamental Rights of the European Union prohibits the use of capital punishment. Also, the Council of Europe, which has 47 member states, prohibits the use of the death penalty by its members. The United Nations General Assembly has adopted, in 2007, 2008, 2010, 2012, and 2014 non-binding resolutions calling for a global moratorium on executions, with a view to eventual abolition. Although most nations have abolished capital punishment, over 60% of the world's population live in countries where executions take place, such as China, India, the United States, and Indonesia." (DBpedia, 2017)
definition: "La peine de mort, ou peine capitale, est une peine prévue par la loi consistant à exécuter une personne ayant été reconnue coupable d'une faute qualifiée de «crime capital». La sentence est prononcée par l'institution judiciaire à l'issue d'un procès. En l'absence d'un procès, ou dans les cas où celui-ci n'est pas réalisé par une institution reconnue, on parle d'exécution sommaire, d'acte de vengeance ou de justice privée. La peine de mort est diversement considérée selon les époques et les régions géographiques. Elle est prévue dans les textes de loi de 93 pays, mais seuls 22 des 192 pays du globe ont procédé à des exécutions en 2014. Elle est une sanction reconnue bien que réprouvée par les institutions internationales comme l'Organisation des Nations unies (ONU). Les États abolitionnistes sont aujourd'hui majoritaires, mais ils ne représentent encore qu'une minorité de la population mondiale. Parmi les démocraties industrialisées, seules deux la pratiquent : les États-Unis et le Japon. Au plan international, le 18 décembre 2007, l’Assemblée générale de l'ONU a adopté la résolution 62/149 appelant à un moratoire sur les exécutions dans le monde. Cette résolution (comme les autres résolutions de l'ONU) n'a pas de valeur contraignante mais peut être vue comme le signe que la majorité des états souhaite remettre en cause la peine de mort. Cependant huit des dix pays les plus peuplés ont voté contre la résolution. Elle a été renouvelée en 2014." (DBpedia, 2017) @fr
in scheme: political affiliation

anti-capitalist
in dataset: The CWRC Ontology
type: political affiliation
type: Concept
comment: La description de ce terme est basée sur celle de DBPedia. @fr
comment: The description for this term is indebted to DBpedia.
label: Anticapitalisme @fr
label: anti-capitalism
definition: "Anti-capitalism encompasses a wide variety of movements, ideas and attitudes that oppose capitalism. Anti-capitalists, in the strict sense of the word, are those who wish to replace capitalism with another type of economic system." (DBpedia, 2017)
definition: "L'anticapitalisme regroupe un ensemble de mouvements qui s'opposent au capitalisme. Les aspects visés diffèrent selon les conceptions et peuvent notamment concerner, sans y être limités, le profit et l'importance de l'argent, la spéculation, le salariat, la concurrence économique, les effets considérés comme des effets néfastes du capitalisme sur la société (comme sa supposée «immoralité», ou les inégalités économiques qu'il est censé entraîner), l'environnement, ou les formes sociales de base du capitalisme. Un spectre politique large et très divers s'est réclamé ou se réclame de l'anticapitalisme." (DBpedia, 2017) @fr
in scheme: political affiliation
related: christian communist

worked against the caste system
in dataset: The CWRC Ontology
type: political affiliation
type: Concept
comment: The description for this term is indebted to DBpedia.
label: anti-caste movement
label: mouvement contre le système de castes @fr
broader transitive: civil rights
broader transitive: progressivism
definition: Advocacy or activism opposing the caste system in India. See Caste system in India - Wikipedia; Caste politics - Wikipedia; Dalit - Wikipedia
definition: Militantisme ou activisme en opposition au système de castes en Inde. Voir Castes en Inde — Wikipédia; Intouchables (Inde) — Wikipédia @fr
in scheme: political affiliation
related: activist for women and children

anti-catholic
in dataset: The CWRC Ontology
contrary to: catholic
type: political affiliation
type: Concept
value: anti-catholic-emancipation
comment: La description de ce terme est basée sur celle de DBPedia. @fr
comment: The description for this term is indebted to DBpedia.
label: Anticatholicisme @fr
label: anti-catholicism
definition: "Anti-Catholicism is hostility towards or opposition to the Catholic Church, its clergy and adherents. After the Reformation and until at least the late 20th Century, majority Protestant states (especially England, Germany, the United States, and Canada) made anti-Catholicism and opposition to the Pope and Catholic rituals major political themes, with anti-Catholic sentiment at times leading to violence and religious discrimination against Catholic individuals (often derogatorily referred to in Anglophone Protestant countries as "papists" or "Romanists"). Historically, Catholics in Protestant countries were frequently (and almost always baselessly) suspected of conspiring against the state in furtherance of papal interests or to establish a political hegemony under the "Papacy", with Protestants sometimes questioning Catholic individuals' loyalty to the state and suspecting Catholics of ultimately maintaining loyalty to the Vatican rather than their domiciled country. In majority Protestant countries with large scale immigration, such as the United States, Canada, and Australia, suspicion or discrimination of Catholic immigrants often overlapped or conflated with nativism, xenophobia, and ethnocentric or racist sentiments (i.e. anti-Italianism, anti-Irish sentiment, hispanophobia, Anti-Quebec sentiment). In the Early modern period, in the face of rising secular powers in Europe, the Catholic Church struggled to maintain its traditional religious and political role in primarily Catholic nations. As a result of these struggles, there arose in some majority Catholic countries (especially among those individuals with certain secular political views) a hostile attitude towards the considerable political, social, spiritual, and religious power of the Pope and the clergy in the form of anti-clericalism." (DBpedia, 2017)
definition: "L'anticatholicisme désigne la méfiance, la discrimination, la répression, ou la persécution du catholicisme et des catholiques." (DBpedia, 2017) @fr
in scheme: political affiliation

Freedom of Speech
in dataset: The CWRC Ontology
type: political affiliation
type: Concept
value: anti-censorship
value: free speech advocate
value: intellectual property activist
value: pro free speech
value: pro-free speech
comment: The description for this term is indebted to DBpedia.
label: anti-censorship movement
label: lutte contre la censure @fr
broader transitive: progressivism
definition: Opposition to censorship. See Freedom of speech - Wikipedia
definition: Opposition à la censure. Voir Liberté d'expression — Wikipédia @fr
in scheme: political affiliation
related: anti-monarchist

anti-communist
in dataset: The CWRC Ontology
contrary to: pro-communism
type: political affiliation
type: Concept
comment: La description de ce terme est basée sur celle de DBPedia. @fr
comment: The description for this term is indebted to DBpedia.
label: Anticommunisme @fr
label: anti-communism
definition: "Anti-communism is opposition to communism. Organized anti-communism developed in reaction to the rise of communism, especially after the 1917 October Revolution in Russia. It reached global dimensions during the Cold War, when America and the Soviet Union engaged in an intense rivalry. Most modern anti-communists reject the concept of historical materialism, which is a central idea in Marxism. Anti-communists reject the Marxist belief that capitalism will be followed by socialism and communism, just as feudalism was followed by capitalism. Anti-communists question the validity of the Marxist claim that the socialist state will "wither away" when it becomes unnecessary in a true communist society. Anti-communists also accuse communists of having caused several famines that occurred in 20th-century communist states, such as the Russian Famine of 1921 and the much more severe famine in China during the Great Leap Forward. Some anti-communists refer to both communism and fascism as totalitarianism, seeing similarity between the actions of communist and fascist governments. Opponents argue that communist parties that have come to power have tended to be rigidly intolerant of political opposition. Communist governments have also been accused of creating a new ruling class (a Nomenklatura), with powers and privileges greater than those previously enjoyed by the upper classes in the non-communist regimes." (DBpedia, 2017)
definition: "Le terme d'anticommunisme englobe, au sens large, l'ensemble des attitudes d'opposition ou d'hostilité envers les aspects théoriques ou pratiques du communisme : l'anticommunisme peut se traduire sous forme de simple prise de position, de discours politique structuré, d'action ou de propagande. Son sens est cependant changeant en fonction de celui du «communisme», mot qui recouvre lui-même un ensemble de réalités très différentes les unes des autres en fonction des contextes sociaux, culturels et politiques. Les facteurs distinguant les différents types d'anticommunisme sont notamment la forme de communisme explicitement visée et les motivations qui poussent à s'opposer au communisme ; le terme «anticommunisme» est employé, selon les époques et les contextes, pour qualifier l'opposition aux théories marxistes ou communistes elles-mêmes, ou aux mouvances et partis politiques s'en réclamant, ou bien à la pratique politique des régimes communistes. Le terme d'«anticommunisme» a pu ainsi être utilisé pour qualifier les opposants au stalinisme, que ces derniers aient été ou non anticommunistes au sens strict. Apparu au XIXe siècle en tant que concept, l'anticommunisme s’est largement développé au cours du XXe siècle, à la suite de la prise du pouvoir par les bolcheviks en Russie en octobre 1917, puis à la création de l’URSS : il s’est alors identifié, pour l'essentiel, à l'opposition aux régimes communistes et aux partis communistes d'inspiration léniniste et stalinienne. Après la Seconde Guerre mondiale, l’anticommunisme devient un élément majeur de la politique étrangère et intérieure des États-Unis, opposés à l'URSS dans le contexte de la guerre froide." (DBpedia, 2017) @fr
in scheme: political affiliation

anti-conscriptionist
in dataset: The CWRC Ontology
contrary to: pro-communism
type: political affiliation
type: Concept
comment: The description for this term is indebted to DBpedia.
label: anti-conscriptionism
label: lutte contre la conscription militaire @fr
definition: Opposition to compulsory enlistment of people in either war or peacetime into a national service, usually military service.
definition: Opposition à la conscription militaire obligatoire pour le service nationale en temps de guerre ou de paix, généralement à travers le service militaire. Voir Antimilitarisme — Wikipédia @fr
in scheme: political affiliation
related: anti-WarMovement

"against the Contagious Diseases Acts"
in dataset: The CWRC Ontology
type: political affiliation
type: Concept
value: anti-contagious diseases act activist
value: anti-contagious diseases acts
comment: The description for this term is indebted to DBpedia.
label: anti-Contagious Diseases Act
label: anti-Contagious Diseases Acte @fr
broader transitive: activist for women and children
broader transitive: progressivism
definition: Opposition to government regulation of prostitution including the forced physical examination of suspected prostitutes for venereal disease. See: Contagious Diseases Acts - Wikipedia
definition: Opposition à la régulation gouvernementale de la prostitution, incluant les examens médicaux forcés conduits sur les prostituées suspectées de véhiculer des maladies vénériennes. Voir Contagious Diseases Acts — Wikipédia; Abolitionnisme (prostitution) — Wikipédia @fr
in scheme: political affiliation

anti-corporal punishment
in dataset: The CWRC Ontology
type: political affiliation
type: Concept
comment: The description for this term is indebted to DBpedia.
label: lutte contre les châtiments corporels @fr
broader transitive: progressivism
definition: "Campaigns against corporal punishment aim to reduce or eliminate corporal punishment of minors by instigating legal and cultural changes in the areas where such punishments are practiced. Such campaigns date mostly from the late 20th century, although occasional voices in opposition to corporal punishment existed from ancient times through to the modern era. The UN Committee on the Rights of the Child defines "corporal punishment" as: any punishment in which physical force is used and intended to cause some degree of pain or discomfort, however light. Most involves hitting ("smacking", "slapping", "spanking") children, with the hand or with an implement – whip, stick, belt, shoe, wooden spoon, etc. But it can also involve, for example, kicking, shaking or throwing children, scratching, pinching, biting, pulling hair or boxing ears, forcing children to stay in uncomfortable positions, burning, scalding, or forced ingestion." (DBpedia, 2017)
in scheme: political affiliation

anti-Dreyfusard
in dataset: The CWRC Ontology
contrary to: Dreyfusard
type: political affiliation
type: Concept
comment: The description for this term is indebted to DBpedia.
label: antidreyfusard @fr
broader transitive: human rights activist
definition: Défenseurs de l'Armée lors de le procès du capitaine Alfred Dreyfus. Voir Affaire Dreyfus — Wikipédia @fr
definition: Supporters of the French military during the prosecution of Captain Alfred Dreyfus. See: Dreyfus affair - Wikipedia
in scheme: political affiliation

anti-European politics
in dataset: The CWRC Ontology
contrary to: pro-European
type: political affiliation
type: Concept
comment: The description for this term is indebted to DBpedia.
label: euroscepticisme @fr
definition: Opposed to the existence, policies, or influence of the European Union. On Euroskepticism, see Euroscepticism - Wikipedia
definition: Opposition à l'existence, aux politiques, ou à l'influence de l'Union Européenne. Sur l'euroscepticisme, voir Euroscepticisme — Wikipédia @fr
in scheme: political affiliation

anti-fascist
in dataset: The CWRC Ontology
contrary to: fascist
type: political affiliation
type: Concept
value: anti-nazi
comment: La description de ce terme est basée sur celle de DBPedia. @fr
comment: The description for this term is indebted to DBpedia.
label: Antifascisme @fr
label: anti-fascism
definition: "Anti-fascism is opposition to fascist ideologies, groups and individuals. The anti-fascist movement began in a few European countries in the 1920s and eventually spread to other countries around the world." (DBpedia, 2017)
definition: "L'antifascisme est l'opposition organisée au fascisme et, plus largement, à l'extrême droite. Il prend forme dans les années 1920 et se développe conséquemment à la montée du fascisme en Europe. Il a connu un très fort développement au cours des années 1930, étant à l'origine de la formation des Fronts populaires , puis pendant la Seconde Guerre mondiale au sein des résistances contre les dictatures fascistes et nazies ainsi que les régimes de collaboration. L'antifascisme peut désigner dans une acception plus large une idéologie tendant à s'opposer également à la droite dite «dure». Certains historiens reprochent à l'antifascisme d'avoir été instrumentalisé par le mouvement communiste." (DBpedia, 2017) @fr
in scheme: political affiliation
related: anti-anti-semitism

anti-federalist
in dataset: The CWRC Ontology
type: political affiliation
type: Concept
comment: La description de ce terme est basée sur celle de DBPedia. @fr
comment: The description for this term is indebted to DBpedia.
label: Antifédéralisme @fr
label: anti-federalism
definition: "Anti-Federalism refers to a movement that opposed the creation of a stronger U.S. federal government and which later opposed the ratification of the 1787 Constitution. The previous constitution, called the Articles of Confederation, gave state governments more authority. Led by Patrick Henry of Virginia, Anti-Federalists worried, among other things, that the position of president, then a novelty, might evolve into a monarchy." (DBpedia, 2017)
definition: Antifédéralisme fut le nom donné à deux mouvements politiques distincts à la fin du XVIIIe siècle aux États-Unis: * Le premier mouvement antifédéraliste des années 1780, s'opposa à la création d'un gouvernement national plus fort, tel que le permettait la Constitution et chercha à le conserver tel qu'il était institué dans les Articles de la Confédération de 1777. * Le second mouvement antifédéraliste se" constitua en réaction aux lois fiscales d'Alexander Hamilton lors du premier mandat de George Washington. Ce mouvement est parfois nommé l'Anti-Administration Party qui deviendra plus tard le Parti républicain-démocrate de Thomas Jefferson et James Madison." (DBpedia, 2017) @fr
in scheme: political affiliation

anti-feminist
in dataset: The CWRC Ontology
contrary to: activist for women and children
contrary to: christian suffragist
type: political affiliation
type: Concept
value: anti-women's liberation
value: antifeminist
value: gender conservative
value: misogynist
value: non-feminist
comment: La description de ce terme est basée sur celle de DBPedia. @fr
comment: The description for this term is indebted to DBpedia.
label: Antiféminisme @fr
label: anti-feminism
definition: "Antifeminism is criticism of some or all feminist ideology, arguing that modern feminism is not practiced in ways that promote true gender equality. This opposition has taken various forms across time and cultures. For example, antifeminists in the late 1800s and early 1900s resisted women's suffrage, while antifeminists in the late 20th century opposed the Equal Rights Amendment. Antifeminism may be motivated by the belief that feminist theories of patriarchy and disadvantages suffered by women in modern society are mischaracterized or exaggerated; that feminism as a movement encourages misandry and results in harm or oppression of men; or driven by general opposition towards women's rights." (DBpedia, 2017)
definition: "L'antiféminisme est un néologisme qualifiant des critiques ou une opposition aux mouvements ou aux thèses féministes, pour des raisons politiques, philosophiques, religieuses, sociologiques ou culturelles. Il s'applique soit à la lutte contre l'émancipation féminine, soit au refus des thèses d'un ou plusieurs mouvements se disant «féministes»." (DBpedia, 2017) @fr
in scheme: political affiliation

anti-globalist
in dataset: The CWRC Ontology
type: political affiliation
type: Concept
comment: La description de ce terme est basée sur celle de DBPedia. @fr
comment: The description for this term is indebted to DBpedia.
label: Mouvement antimondialisation @fr
label: anti-globalism
definition: "Le mouvement antimondialisation désigne le mouvement d'opposition à la mondialisation." (DBpedia, 2017) @fr
definition: "The anti-globalization movement, or counter-globalization movement, is a social movement critical of the globalization of corporate capitalism. The movement is also commonly referred to as the global justice movement, alter-globalization movement, anti-globalist movement, anti-corporate globalization movement, or movement against neoliberal globalization. Participants base their criticisms on a number of related ideas. What is shared is that participants oppose what they see as large, multi-national corporations having unregulated political power, exercised through trade agreements and deregulated financial markets. Specifically, corporations are accused of seeking to maximize profit at the expense of work safety conditions and standards, labor hiring and compensation standards, environmental conservation principles, and the integrity of national legislative authority, independence and sovereignty. As of January 2012, some commentators have characterized the unprecedented changes in the global economy as "turbo-capitalism" (Edward Luttwak), "market fundamentalism" (George Soros), "casino capitalism" (Susan Strange), and as "McWorld" (Benjamin Barber). Many anti-globalization activists call for forms of global integration that better provide democratic representation, advancement of human rights, fair trade and sustainable development and therefore feel the term "anti-globalization" is misleading." (DBpedia, 2017)
in scheme: political affiliation

anti-colonial
in dataset: The CWRC Ontology
contrary to: colonialist
type: political affiliation
type: Concept
value: anti-colonialism
value: anti-colonialist
value: anti-imperial
value: anti-imperialist
comment: La description de ce terme est basée sur celle de DBPedia. @fr
comment: The description for this term is indebted to DBpedia.
label: Anti-impérialisme @fr
label: anti-imperialism
broader transitive: human rights activist
definition: ""Anti-imperialism" in political science and international relations is a term used in a variety of contexts, usually by nationalist movements, who want to secede from a larger polity (usually in the form of an empire, but also in a multi-ethnic sovereign state) or as a specific theory opposed to capitalism in Marxist–Leninist discourse, derived from Vladimir Lenin's work Imperialism, the Highest Stage of Capitalism. A less common usage is by isolationists who oppose an interventionist foreign policy. People who categorise themselves as anti-imperialists, often state that they are opposed to colonialism, colonial empire, hegemony, imperialism, and territorial expansion of a country beyond its established borders. The phrase gained a wide currency after the Second World War and at the onset of the Cold War as political movements in colonies of European powers promoted national sovereignty. Some "anti-imperialist" groups who opposed the United States supported the power of the Soviet Union, such as in Guevarism, while in Maoism, this was criticized as "social imperialism". In the Arab and Muslim world, the term is often used in the context of Anti-Zionist nationalist and religious movements." (DBpedia, 2017)
definition: "L'anti-impérialisme est une idéologie d’opposition à l'impérialisme, c'est-à-dire la doctrine d'un État ou un groupe d'États à mettre un autre État ou un groupe d'États plus faible sous sa dépendance politique, économique et culturelle par la conquête militaire ou toute autre forme de coercition. Cette idéologie est corollaire au processus de décolonisation, aux mouvements de libération nationale et, dans une certaine mesure, au nationalisme. Bien que le terme impérialisme est utilisé la langue française au cours XIXe siècle pour désigner l'appui au régime napoléonien et le «système de gouvernement et de domination de l'Empire romain», l'anti-impérialisme prend son origine durant la seconde moitié de XIXe siècle de l'anglais imperialism qui désigne d'abord la politique d'extension coloniale de l'Empire britannique sous le premier ministre britannique Benjamin Disraeli au cours des années 1870. Le concept sera approfondi par John Atkinson Hobson en 1902 dans son livre Imperialism: A Study. L'anti-impérialisme est aussi une notions cruciale du marxisme-léninisme. Le concept, qui diffère de l'usage commun, est approfondi dans le livre de 1917 L'Impérialisme, stade suprême du capitalisme de Lénine entre autres. Dans la théorie marxiste, l'impérialisme est un stade du capitalisme au cours duquel le capital financier supplante toutes les autres formes du capital. L'anti-impérialisme a été l'un des principales politique de l'URSS, de la République populaire de Chine, de Cuba et des autres pays communistes depuis la seconde moitié du XXe siècle. La fin du XXe siècle sous l'hégémonie des États-Unis voit la naissance d'un nouvel impérialisme . L'anti-impérialisme, dans ces circonstances, est une part intégrante du mouvement altermondialiste qui s'oppose à la mondialisation libérale et aux grands accords de libre-échange et du mouvement pacifiste qui s'oppose aux invasions militaires." (DBpedia, 2017) @fr
in scheme: political affiliation
related: anti-British politics

anti-revolutionary
in dataset: The CWRC Ontology
type: political affiliation
type: Concept
comment: The description for this term is indebted to DBpedia.
label: anti-Jacobin
definition: Opposed to Jacobinism. See Jacobin - Wikipedia
definition: Opposition au jacobinisme. Voir Jacobinisme — Wikipédia @fr
in scheme: political affiliation

anti-Jacobite
in dataset: The CWRC Ontology
contrary to: jacobite
type: political affiliation
type: Concept
comment: The description for this term is indebted to DBpedia.
definition: Opposed to Jacobitism. See Jacobitism - Wikipedia
definition: Opposition au jacobitisme. Voir Jacobitisme — Wikipédia @fr
in scheme: political affiliation

anti-Irish National Land League
in dataset: The CWRC Ontology
type: political affiliation
type: Concept
comment: The description for this term is indebted to DBpedia.
definition: Opposed to the Irish Land League movement. See Irish National Land League - Wikipedia
definition: Opposition au mouvement de la Irish Land Lead. @fr
in scheme: political affiliation
related: anti-home rule

anti-monarchist
in dataset: The CWRC Ontology
contrary to: monarchist
type: political affiliation
type: Concept
comment: The description for this term is indebted to DBpedia.
label: anti-monarchism
label: antimonarchisme @fr
definition: "The abolition of monarchy has occurred throughout history, either through revolutions, coups d'état, wars, or legislative reforms (such as abdications). The founding of the Roman Republic is a noteworthy example and became part of the nation's traditions including as justification for the assassination of Julius Caesar. The twentieth century saw a major acceleration of this process, with many monarchies violently overthrown by revolution or war, or else abolished as part of the process of decolonisation. By contrast, the restoration of monarchies is rare in modern times, with only two major examples, Spain and Cambodia." (DBpedia, 2017)
in scheme: political affiliation

Campaign for Nuclear Disarmament
in dataset: The CWRC Ontology
type: political affiliation
type: Concept
value: anti-nuclear
value: anti-nuclear activist
value: anti-nuclear war
value: anti-nuclear weapons
value: nuclear disarmament
value: nuclear disarmament campaigner
value: pro nuclear disarmament
comment: La description de ce terme est basée sur celle de DBPedia. @fr
comment: The description for this term is indebted to DBpedia.
label: Mouvement antinucléaire @fr
label: anti-nuclear movement
broader transitive: ecologist
definition: "Le mouvement antinucléaire désigne l'ensemble des personnes et organisations (associations, syndicats, partis politiques) qui s'opposent de façon générale à l'utilisation de l'énergie nucléaire. Cette opposition peut s'étendre de la bombe atomique aux armes utilisant l’uranium appauvri, jusqu'à la production d’électricité d’origine nucléaire, l’irradiation des aliments et l’utilisation de la radioactivité. Les opposants au nucléaire soutiennent qu'il existe des solutions alternatives, telles que les économies d'énergie ou les énergies renouvelables et que l'uranium est, de même que les énergies fossiles, une source d'énergie dont l'épuisement est attendu dans quelques décennies. Il existe aussi une opposition spécifique à l'arme nucléaire, que l'on peut qualifier de «mouvement antinucléaire militaire». Les opposants au nucléaire soutiennent notamment qu'il existe des liens étroits entre le nucléaire civil et militaire, et que le nucléaire civil a une responsabilité lourde dans la prolifération nucléaire." (DBpedia, 2017) @fr
definition: "The anti-nuclear movement is a social movement that opposes various nuclear technologies. Some direct action groups, environmental groups, and professional organisations have identified themselves with the movement at the local, national, and international level. Major anti-nuclear groups include Campaign for Nuclear Disarmament, Friends of the Earth, Greenpeace, International Physicians for the Prevention of Nuclear War, and the Nuclear Information and Resource Service. The initial objective of the movement was nuclear disarmament, though since the late 1960s opposition has included the use of nuclear power. Many anti-nuclear groups oppose both nuclear power and nuclear weapons. The formation of green parties in the 1970s and 1980s was often a direct result of anti-nuclear politics. Scientists and diplomats have debated nuclear weapons policy since before the atomic bombings of Hiroshima and Nagasaki in 1945. The public became concerned about nuclear weapons testing from about 1954, following extensive nuclear testing in the Pacific. In 1963, many countries ratified the Partial Test Ban Treaty which prohibited atmospheric nuclear testing. Some local opposition to nuclear power emerged in the early 1960s, and in the late 1960s some members of the scientific community began to express their concerns. In the early 1970s, there were large protests about a proposed nuclear power plant in Wyhl, West Germany. The project was cancelled in 1975 and anti-nuclear success at Wyhl inspired opposition to nuclear power in other parts of Europe and North America. Nuclear power became an issue of major public protest in the 1970s. A protest against nuclear power occurred in July 1977 in Bilbao, Spain, with up to 200,000 people in attendance. Following the Three Mile Island accident in 1979, an anti-nuclear protest was held in New York City, involving 200,000 people. In 1981, Germany's largest anti-nuclear power demonstration took place to protest against the Brokdorf Nuclear Power…
in scheme: political affiliation

anti-appeasement
in dataset: The CWRC Ontology
contrary to: pacifist
type: political affiliation
type: Concept
value: conscriptionist
value: war supporter
comment: The description for this term is indebted to DBpedia.
label: anti-pacifism
label: antipacifisme @fr
definition: Opposed to pacifism. See Pacifism - Wikipedia
definition: Opposition au pacifisme. Voir Pacifisme — Wikipédia @fr
in scheme: political affiliation

anti-poverty activist
in dataset: The CWRC Ontology
type: political affiliation
type: Concept
value: anti-poverty movement
value: poverty activist
comment: The description for this term is indebted to DBpedia.
label: mouvement de lutte contre la pauvreté @fr
definition: Advocacy or activism to reduce poverty. See Poverty reduction - Wikipedia
definition: Militantisme pour réduire la pauvreté. Voir Pauvreté — Wikipédia @fr
in scheme: political affiliation

anti-racist
in dataset: The CWRC Ontology
contrary to: racist
type: political affiliation
type: Concept
comment: La description de ce terme est basée sur celle de DBPedia. @fr
comment: The description for this term is indebted to DBpedia.
label: Antiracisme @fr
label: anti-racism
broader transitive: civil rights
definition: "Anti-racism includes beliefs, actions, movements, and policies adopted or developed to oppose racism. In general, anti-racism is intended to promote an egalitarian society in which people do not face discrimination on the basis of their race, however defined. By its nature, anti-racism tends to promote the view that racism in a particular society is both pernicious and socially pervasive, and that particular changes in political, economic, and/or social life are required to eliminate it." (DBpedia, 2017)
definition: "L'antiracisme inclut les opinions, actions, mouvements et les politiques adoptées ou développée pour s'opposer au racisme. En général l'antiracisme promeut une société dans laquelle les individus ne subissent pas de discrimination sur la base de leur ethnie dont la définition peut varier. De par sa nature, l'antiracisme avance la vision que le racisme dans une société est à la fois pernicieux et socialement pénalisant et que des changements politiques, économiques et/ou sociaux sont nécessaires pour l'éradiquer. La notion d'antiracisme, tout comme les acteurs de la lutte dite antiraciste, ont été critiqués par certains intellectuels notamment pour sa faiblesse conceptuelle, ses utilisations politiques, voire paradoxalement par la réintroduction de la notion de race au sein du débat national." (DBpedia, 2017) @fr
in scheme: political affiliation
related: anti-segregationist

anti-socialist
in dataset: The CWRC Ontology
contrary to: militant socialist
type: political affiliation
type: Concept
comment: La description de ce terme est basée sur celle de DBPedia. @fr
comment: The description for this term is indebted to DBpedia.
label: Critiques du socialisme @fr
label: anti-socialism
definition: "Criticism of socialism refers to any critique of socialist models of economic organisation and their feasibility; as well as the political and social implications of adopting such a system. Some criticisms are not directed towards socialism as a system, but are directed towards the socialist movement, socialist political parties or existing socialist states. Some critics consider socialism to be a purely theoretical concept that should be criticized on theoretical grounds (such as in the Socialist calculation debate); others hold that certain historical examples exist and that they can be criticized on practical grounds. Economic liberals and right libertarians view private ownership of the means of production and the market exchange as natural entities or moral rights which are central to their conceptions of freedom and liberty, and view the economic dynamics of capitalism as immutable and absolute. Therefore, they perceive public ownership of the means of production, cooperatives and economic planning as infringements upon liberty. According to the Austrian school economist Ludwig von Mises, an economic system that does not utilize money, financial calculation and market pricing will be unable to effectively value capital goods and coordinate production, and therefore socialism is impossible because it lacks the necessary information to perform economic calculation in the first place. Another central argument leveled against socialist systems based on economic planning is based on the use of dispersed knowledge. Socialism is unfeasible in this view because information cannot be aggregated by a central body and effectively used to formulate a plan for an entire economy, because doing so would result in distorted or absent price signals. Many economic criticisms of socialism focus on the experiences of Soviet-type planned economies. It is argued that a lack of budget constraints in enterprises operating in a planned economy reduces incentives for enterprises to ac…
definition: "Les critiques du socialisme se réfèrent aux critiques des modèles socialistes d'organisation économique, de leurs efficacités et de leurs faisabilités, ainsi que des implications politiques et sociales de tels systèmes. Certaines critiques ne sont pas dirigées vers le socialisme en tant que système, mais sont dirigés vers des mouvements socialistes, des partis politiques socialistes ou des états socialistes existants. Certaines critiques considèrent le socialisme comme un concept purement théorique qui doit être critiqué pour des raisons théoriques, d'autres soutiennent que les expériences socialistes peuvent être critiquées sur les faits. Certains encore veulent englober plusieurs exemples historiques d'États communistes dans une forme de socialisme.Le socialisme est donc une notion large, certaines critiques présentées dans cet article ne s'appliqueront qu'a un modèle spécifique du socialisme qui peuvent différer considérablement des autres types de socialisme. Les libéraux économiques, libertariens, pro-capitalistes et quelques libéraux classiques considèrent l'entreprise privée, la propriété privée des moyens de production et l'échange sur le marché comme des phénomènes naturels ou moraux[pas clair], au centre de leurs conceptions de la liberté. Et par opposition, les membres de ces trois groupes peuvent percevoir la propriété publique des moyens de production, des coopératives et de la planification économique parrainé par l'État comme des atteintes à la liberté[pas clair]. Les membres de l'école néoclassique d'économie critiquent les théories socialistes qui favorisent la participation de l'État ou de la centralisation du capital sur les motifs du manque de motivation au sein des institutions de l'État d'agir sur l'information aussi efficacement que les gestionnaires dans les entreprises capitalistes parce qu'ils n'ont pas de forte contrainte (profit et mécanisme de perte), ce qui réduit le bien-être économique global pour la société. Les membres de l'école a… @fr
in scheme: political affiliation

anti-sufffragist
in dataset: The CWRC Ontology
contrary to: christian suffragist
type: political affiliation
type: Concept
value: anti-suffragist
comment: The description for this term is indebted to DBpedia.
label: anti-suffrage
label: opposition au suffrage universel @fr
definition: "Anti-suffragism was a political movement composed mainly of women, begun in the late 19th century in order to campaign against women's suffrage in Great Britain and the United States. It was closely associated with "domestic feminism", the belief that women had the right to complete freedom within the home." (DBpedia, 2017)
in scheme: political affiliation

anti-trade-unionist
in dataset: The CWRC Ontology
contrary to: labourMouvement
type: political affiliation
type: Concept
comment: The description for this term is indebted to DBpedia.
label: anti-trade-unionism
label: opposition au syndicalisme @fr
definition: Opposed to trade unions or the trade union movement. See Trade union - Wikipedia
definition: Opposition aux syndicats ou au mouvement syndical. Voir Répression antisyndicale — Wikipédia @fr
in scheme: political affiliation

pro-countryside
in dataset: The CWRC Ontology
type: political affiliation
type: Concept
comment: The description for this term is indebted to DBpedia.
label: anti-urbanism
label: antiurbain @fr
definition: "Anti-urbanism is hostility towards the city as opposed to the country, a simple rejection of the city, or a wish to destroy the city." (DBpedia, 2017)
definition: "L’antiurbain est l’hostilité à l’égard de la ville par opposition à la campagne, un rejet pur et simple, une volonté de détruire la ville. " (DBpedia, 2017) @fr
in scheme: political affiliation

movement against compulsory vaccination
in dataset: The CWRC Ontology
type: political affiliation
type: Concept
comment: The description for this term is indebted to DBpedia.
label: anti-vaccination movement
label: mouvement contre la vaccination @fr
definition: Opposition to vaccination, usually compulsory vaccination. See Vaccine controversies - Wikipedia Also see: Category:Vaccine controversies - Wikipedia
definition: Opposition à la vaccination, généralement lorsqu'elle est obligatoire. Voir Controverse sur la vaccination — Wikipédia @fr
in scheme: political affiliation

anti-vivisectionist
in dataset: The CWRC Ontology
type: political affiliation
type: Concept
comment: The description for this term is indebted to DBpedia.
label: anti-vivisection
label: antivivisection @fr
definition: Opposition to experimentation and testing on live animals. See Category:Anti-vivisection movement - Wikipedia Also see Vivisection - Wikipedia
definition: Opposition à l'expérimentation et aux tests conduits sur des animaux vivants. Voir Ligue française contre la vivisection — Wikipédia. Voir aussi Vivisection — Wikipédia @fr
in scheme: political affiliation
related: activist for women and children

anti Vietnam war
in dataset: The CWRC Ontology
contrary to: pro-BoerWar
type: political affiliation
type: Concept
value: anti-militarism
value: anti-militaristic
value: anti-war
value: anti-war activism
value: vietnam war protester
comment: La description de ce terme est basée sur celle de DBPedia. @fr
comment: The description for this term is indebted to DBpedia.
label: Antiguerre @fr
label: anti-war movement
broader transitive: pacifist
definition: "An anti-war movement (also antiwar) is a social movement, usually in opposition to a particular nation's decision to start or carry on an armed conflict, unconditional of a maybe-existing just cause. The term can also refer to pacifism, which is the opposition to all use of military force during conflicts. Many activists distinguish between anti-war movements and peace movements. Anti-war activists work through protest and other grassroots means to attempt to pressure a government (or governments) to put an end to a particular war or conflict." (DBpedia, 2017)
definition: "Le mouvement antiguerre est un mouvement social[réf. nécessaire] s'opposant aux conflits armés." (DBpedia, 2017) @fr
in scheme: political affiliation

anti-israel
in dataset: The CWRC Ontology
contrary to: zionist
type: political affiliation
type: Concept
value: anti-zionist
comment: La description de ce terme est basée sur celle de DBPedia. @fr
comment: The description for this term is indebted to DBpedia.
label: Antisionisme @fr
label: anti-Zionism
definition: "Anti-Zionism is opposition to Zionism, broadly defined in the modern era as the opposition to the ethnonationalist and political movement of Jews and Jewish culture that supports the establishment of a Jewish state as a Jewish homeland in the territory defined as the historic Land of Israel (also referred to as Palestine, Canaan or the Holy Land) or to the modern State of Israel as defined as A Jewish and Democratic State. The term is used to describe various religious, moral, and political points of view, but their diversity of motivation and expression is sufficiently different that "anti-Zionism" cannot be seen as having a single ideology or source. According to many notable Jewish and non-Jewish sources, anti-Zionism has become a cover for modern-day antisemitism, a position that critics have challenged as a tactic to silence criticism of Israeli policies." (DBpedia, 2017)
definition: "L'antisionisme (ou anti-sionisme) désigne historiquement l'opposition au projet sioniste d'établissement d'un foyer national juif en Palestine. Il apparaît d'une part parmi les dirigeants traditionalistes juifs pour des raisons religieuses ou par crainte des Juifs assimiliationistes et d'autre part parmi les dirigeants arabes de Palestine et certains officiers britanniques quand la Grande-Bretagne obtient de la société des Nations un mandat pour administrer le pays. Outre l'opposition politique, l'antisionisme arabe palestinien de l'époque se manifeste lors de la Grande Révolte arabe de 1936-1939 et puis par la Guerre israélo-arabe de 1948. L'antisionisme juif est moins important et d'origine religieuse. Il se réduit fortement à partir de 1921 avec la nomination au grand rabbinat d'Eretz Israel du rabbin Abraham Isaac Kook pour disparaître presque totalement après la Shoah, la Résolution 181 de l'ONU du 30 novembre 1947 qui prévoit le Plan de partage de la Palestine et l'établissement d'un État juif, l'État d'Israël, que les Arabes tentèrent vainement d'empêcher lors de la guerre de 1948 et qui est l'aboutissement du projet sioniste originel. Après la guerre de 1967 et les conquêtes territoriales israéliennes, et en parallèle avec la médiatisation de la cause palestinienne et du problème des réfugiés palestiniens, la notion d'antisionisme évolue et devient plus ambiguë. Le terme peut caractériser des prises de positions aussi éloignées que le simple rejet de la politique israélienne à la revendication de son anéantissement. Ainsi, l'antisionisme est parfois invoqué comme une échappatoire pour voiler une nouvelle forme d'antisémitisme et cette accusation est elle-même dénoncée comme une manipulation visant à empêcher toute critique d'Israël et du sionisme. En Israël même, la situation a engendré les mouvements néosioniste et postsioniste, tous deux en opposition avec le «sionisme séculaire» des «pères fondateurs» mais pas nécessairement antisionistes." (DBpedia, 201… @fr
in scheme: political affiliation

antidisestablishmentarian
in dataset: The CWRC Ontology
contrary to: anti-anglican
type: political affiliation
type: Concept
comment: The description for this term is indebted to DBpedia.
label: antidisestablishmentarianism
label: opposition à l'Establismhment @fr
definition: "Antidisestablishmentarianism (/ˌæn.ti.dɪs.ɪs.tæb.lɪʃ.mənˈtɛə.rɪə.nɪ.zᵊm/, /ˌæn.taɪˌdɪs.ɛsˌtæb.lɪʃ.məntˈɛ.ri.ənˌɪ.zm/) is a political position that developed in 19th-century Britain in opposition to Liberal proposals for the disestablishment of the Church of England—meaning the removal of the Anglican Church's status as the state church of England, Ireland, and Wales. The establishment was maintained in England, but in Ireland the Church of Ireland (Anglican) was disestablished in 1871. In Wales, four Church of England dioceses were disestablished in 1920 and became the Church in Wales. Antidisestablishmentarianism is also one of the longest non-scientific words. The word has also come by analogy to refer to any opposition to those who oppose the establishment, whether the government, in whole or part, or the established society." (DBpedia, 2017)
in scheme: political affiliation

anti-semitism
in dataset: The CWRC Ontology
type: political affiliation
type: Concept
value: antisemitic
comment: La description de ce terme est basée sur celle de DBPedia. @fr
comment: The description for this term is indebted to DBpedia.
label: Antisémitisme @fr
label: antisemitism
broader transitive: racist
definition: "Antisemitism (also spelled anti-Semitism or anti-semitism) is hostility, prejudice, or discrimination against Jews. A person who holds such positions is called an antisemite. Antisemitism is widely considered to be a form of racism. The root word Semite gives the false impression that antisemitism is directed against all Semitic people. However, the compound word antisemite was popularized in Germany in 1879 as a scientific-sounding term for Judenhass ("Jew-hatred") ,and that has been its common use since then. Antisemitism may be manifested in many ways, ranging from expressions of hatred of or discrimination against individual Jews to organized pogroms by mobs, state police, or even military attacks on entire Jewish communities. Although the term did not come into common usage until the 19th century, it is now also applied to historic anti-Jewish incidents. Notable instances of persecution include the Rhineland massacres preceding the First Crusade in 1096, the Edict of Expulsion from England in 1290, the massacres of Spanish Jews in 1391, the persecutions of the Spanish Inquisition, the expulsion from Spain in 1492, the Cossack massacres in Ukraine from 1648 to 1657, various anti-Jewish pogroms in the Russian Empire between 1821 and 1906, the 1894–1906 Dreyfus affair in France, the Holocaust in German-occupied Europe, official Soviet anti-Jewish policies, and Arab and Muslim involvement in the Jewish exodus from Arab and Muslim countries." (DBpedia, 2017)
definition: "L’antisémitisme (originellement : anti-sémitisme) est le nom donné de nos jours à la discrimination et à l'hostilité manifestées à l'encontre des Juifs en tant que groupe ethnique, religieux ou racial. Il s'agit, dans son acception originelle telle que formulée vers la fin du XIXe siècle, d'une forme de racisme dirigée nominalement contre les peuples sémites, regroupés en tant que tels sur base de critères linguistiques, mais ne visant en réalité que les Juifs. Bien que certains historiens comme Jules Isaac insistent pour distinguer antijudaïsme et antisémitisme, le second terme est cependant le plus souvent utilisé aujourd'hui pour qualifier tous les actes d’hostilité anti-juive au cours de l'Histoire, que leurs fondements soient raciaux ou non. Les motifs et mises en pratique de l'antisémitisme incluent divers préjugés, des allégations, des mesures discriminatoires ou d’exclusion socio-économique, des expulsions, voire des massacres d’individus ou de communautés entières." (DBpedia, 2017) @fr
in scheme: political affiliation

advocate for the arts
in dataset: The CWRC Ontology
type: political affiliation
type: Concept
value: artists' advocate
comment: The description for this term is indebted to DBpedia.
label: arts advocacy
label: défense des arts @fr
definition: Action pour les beaux arts, les arts du spectale ou les humanités. @fr
definition: Advocacy for the fine, performing, or liberal arts.
in scheme: political affiliation

Ashkenazim
in dataset: The CWRC Ontology
type: ethnicity
type: Concept
value: Ashkenazim, or German Jewish
label: Ashkenazi Jewish
label: Juif ashkénaze @fr
broader: Jewish
definition: "Ashkenazi Jews, also known as Ashkenazic Jews or simply Ashkenazim (Hebrew: אַשְׁכְּנַזִּים, Ashkenazi Hebrew pronunciation: [ˌaʃkəˈnazim], singular: [ˌaʃkəˈnazi], Modern Hebrew: [aʃkenaˈzim, aʃkenaˈzi]; also יְהוּדֵי אַשְׁכֲּנַז Y'hudey Ashkenaz), are a Jewish diaspora population who coalesced as a distinct community of Jews in the Holy Roman Empire around the end of the 1st millennium. The traditional diaspora language of Ashkenazi Jews consisted of various dialects of Yiddish." (DBpedia, 2017)
definition: «L'appellation Ashkénaze, Ashkenaze ou Achkenaze désigne 'les Juifs de l'Europe occidentale, centrale et orientale qui sont d'origine et de langue germaniques par opposition à ceux qui sont originaires d'Espagne et sont dits séfarades (sefardim)' et aux Juifs descendant des communautés juives des régions proche et moyen-orientales dits Mizrahim. Leur nom vient du patriarche biblique Ashkenaz. Les communautés ashkénazes se sont principalement concentrées en Allemagne, en Pologne, en Russie, dans l'ancien Empire austro-hongrois et, de façon plus clairsemée, dans le reste de l'Europe centrale et orientale. Les Ashkénazes sont caractérisés par des coutumes, un héritage culturel et des traditions religieuses particulières. À la différence des communautés séfarades ou mizrahim, la langue vernaculaire des Ashkénazes est le yiddish5, variété de moyen-haut allemand enrichie d’emprunts à l’hébreu, au polonais et au russe6). Certaines sources attestent de leur présence dans toute l'Europe du nord-ouest au début du Moyen ge. Les Ashkénazes constituent aujourd'hui la catégorie la plus nombreuse du judaïsme mondial.» (DBpedia, 2017) @fr
in scheme: ethnicity

Asian
in dataset: The CWRC Ontology
type: race or colour
type: Concept
label: Asiatique @fr
definition: "Asian people or Asiatic people are people who descend from a portion of Asia's population. There are varieties of definition and geographical data presented by organisations and individuals for classifying the ethnic groups in Asia."(DBpedia, 2017)
definition: «Le terme asiatique désigne une personne originaire d'Asie, et présentant des caractéristiques physiques d'Asie de l'Est, d'Asie du Sud-Est et de certaines régions d'Asie centrale. En français, l'adjectif asiatique désigne, au sens large, tout ce qui se rapporte à l'Asie : dans le langage courant, quand il se rapporte à des personnes, il est cependant essentiellement utilisé pour désigner les populations originaires de ces régions asiatiques. Les personnes originaires d'autres régions d'Asie comme le Moyen-Orient ou le sous-continent indien ne sont que rarement appelées Asiatiques, bien qu'elles le soient également au sens géographique.» @fr
in scheme: race or colour
name: asian (race colour)

Atheism
in dataset: The CWRC Ontology
type: religion
type: Concept
comment: La description de ce terme est basée sur celle de DBPedia. @fr
comment: The description for this term is indebted to DBpedia.
label: athéisme @fr
definition: "Atheism is, in a broad sense, the rejection of belief in the existence of deities. In a narrower sense, atheism is specifically the position that there are no deities. Most inclusively, atheism is the absence of belief that any deities exist. Atheism is contrasted with theism, which, in its most general form, is the belief that at least one deity exists. The term "atheism" originated from the Greek ἄθεος (atheos), meaning "without god(s)", used as a pejorative term applied to those thought to reject the gods worshiped by the larger society. With the spread of freethought, skeptical inquiry, and subsequent increase in criticism of religion, application of the term narrowed in scope. The first individuals to identify themselves using the word "atheist" lived in the 18th century during the Age of Enlightenment. The French Revolution, noted for its "unprecedented atheism," witnessed the first major political movement in history to advocate for the supremacy of human reason. Arguments for atheism range from the philosophical to social and historical approaches. Rationales for not believing in deities include arguments that there is a lack of empirical evidence; the problem of evil; the argument from inconsistent revelations; the rejection of concepts that cannot be falsified; and the argument from nonbelief. Although some atheists have adopted secular philosophies (eg. humanism and skepticism), there is no one ideology or set of behaviors to which all atheists adhere. Many atheists hold that atheism is a more parsimonious worldview than theism and therefore that the burden of proof lies not on the atheist to disprove the existence of God but on the theist to provide a rationale for theism. Since conceptions of atheism vary, accurate estimations of current numbers of atheists are difficult. Several comprehensive global polls on the subject have been conducted by Gallup International: their 2015 poll featured over 64,000 respondents and indicated that 11% were "convinced …
definition: "L’athéisme est une attitude ou une doctrine qui nie l’existence de quelque dieu ou divinité que ce soit, contrairement, par exemple, au déisme et au théisme qui soutiennent ces existences, ou à l’agnosticisme qui considère que personne ne peut répondre à ces questions. C'est une position philosophique qui peut être formulée ainsi : il n'existe rien qui ressemble de près ou de loin à ce que les croyants appellent un «dieu», ou «Dieu»." (DBpedia, 2017) @fr
in scheme: religion

attends
in dataset: The CWRC Ontology
type: ObjectProperty
domain: natural person
range: School
inverse of: has Student
definition: Indicates attending or having attended for education either a particular school or a particular type of schooling.

AUNT
in dataset: The CWRC Ontology
type: ObjectProperty
label: aunt of
label: tante de @fr
sub property of: FAMILY

awarded to
in dataset: The CWRC Ontology
type: ObjectProperty

Baptist Christianity
in dataset: The CWRC Ontology
type: religion
type: Concept
comment: La description de ce terme est basée sur celle de DBPedia. @fr
comment: The description for this term is indebted to the Getty Art & Architecture Thesaurus.
label: Baptisme @fr
label: Baptismo @es
label: Baptistas @es
label: chin li tsung @zh-latn
label: jin li zong @zh-latn
label: jìn lǐ zōng @zh-latn
label: 浸信會 @zh-hant
label: 浸禮宗 @zh-hant
label: 浸禮派 @zh-hant
broader transitive: Dissent (Protestant)
definition: "Le baptisme est un courant chrétien évangélique issu d'un réveil démarré par les pasteurs anglais John Smyth en Hollande en 1609, puis Thomas Helwys en Angleterre en 1612. Ce mouvement se caractérise par l'importance donnée à la Bible, à la nouvelle naissance, au baptême adulte en tant que témoignage volontaire, un esprit missionnaire, un engagement moral de vie ainsi que par l’autonomie locale des églises, la séparation de l’Église et de l’État, et finalement l’autorité de la congrégation (congrégationalisme). Selon les chiffres du Pew Research Center, en 2011, le mouvement recense 72 millions de croyants." (DBpedia, 2017) @fr
definition: "Refers to a Protestant denomination centered around the belief that the sacrament of baptism should only be administered to adult members after a personal profession of belief in Jesus Christ. Baptism in this faith is usually done by full immersion. Emphasis is placed on biblical scripture and preaching. The Baptist denomination is primarily derived from early 17th-century England and Wales where it quickly spread although there are some links with the Anabaptists of the 16th century. Baptist churches very rapidly increased in the late 19th century in the United States." (Getty, 2017)
definition: "Se refiere a la religión protestante centrada en torno a la creencia que el sacramento del bautismo debería ser administrado sólo a miembros adultos tras una manifestación personal de creencia en Jesucristo. El bautismo en esta fe es usualmente hecho por inmersión total. El énfasis es puesto en las Escrituras Bíblicas y la oración. La denominación baptista deriva principalmente de la Inglaterra y Gales del siglo XVII en donde rápidamente se difundió a pesar que hay algunas conexiones con los Anabaptistas del siglo XVI. La iglesia baptista creció rápidamente en el siglo XIX en los Estados Unidos." (Getty, 2017) @es
definition: "Verwijst naar een protestantse gezindte waarbij het geloof centraal staat dat het sacrament van de doop alleen moet worden toegediend aan volwassen leden na een persoonlijke belijdenis van geloof in Jezus Christus. De doop vindt bij deze gezindte doorgaans plaats door volledige onderdompeling. De nadruk ligt op Bijbelse geschriften en preken. Het baptisme is in hoofdzaak ontstaan in de vroege 17de eeuw in Engeland en Wales waar het zich snel verspreidde, hoewel er enige verbanden zijn met de anabaptisten van de 16de eeuw. In de late 19de eeuw nam het aantal baptistische kerken in de Verenigde Staten snel toe." (Getty, 2017) @nl
definition: "一支新教派別，相信只有親自聲明信仰基督的成人才可受洗。此教的洗禮通常需全身浸洗。重視聖經經文與佈道。浸信會與十六世紀的重浸派有些淵源，但主要源於十七世紀初的英格蘭與威爾斯，在這兩處快速廣傳。其教會於十九世紀末在美國急速增加。" (Getty, 2017) @zh-hant
in scheme: religion

Baptist
is replaced by: Baptist Christianity
in dataset: The CWRC Ontology
type: Concept
comment: Deprecated in favour of instance Baptist Christianity.
comment: Désapprouver en faveur de l'instance Baptisme. @fr
comment: La description de ce terme est basée sur celle de DBPedia. @fr
comment: The description for this term is indebted to the Getty Art & Architecture Thesaurus.
label: Baptisme @fr
label: Baptismo @es
label: Baptistas @es
label: chin li tsung @zh-latn
label: jin li zong @zh-latn
label: jìn lǐ zōng @zh-latn
label: 浸信會 @zh-hant
label: 浸禮宗 @zh-hant
label: 浸禮派 @zh-hant
deprecated: true
term status: deprecated
broader transitive: Christianity
definition: "Le baptisme est un courant chrétien évangélique issu d'un réveil démarré par les pasteurs anglais John Smyth en Hollande en 1609, puis Thomas Helwys en Angleterre en 1612. Ce mouvement se caractérise par l'importance donnée à la Bible, à la nouvelle naissance, au baptême adulte en tant que témoignage volontaire, un esprit missionnaire, un engagement moral de vie ainsi que par l’autonomie locale des églises, la séparation de l’Église et de l’État, et finalement l’autorité de la congrégation (congrégationalisme). Selon les chiffres du Pew Research Center, en 2011, le mouvement recense 72 millions de croyants." (DBpedia, 2017) @fr
definition: "Refers to a Protestant denomination centered around the belief that the sacrament of baptism should only be administered to adult members after a personal profession of belief in Jesus Christ. Baptism in this faith is usually done by full immersion. Emphasis is placed on biblical scripture and preaching. The Baptist denomination is primarily derived from early 17th-century England and Wales where it quickly spread although there are some links with the Anabaptists of the 16th century. Baptist churches very rapidly increased in the late 19th century in the United States." (Getty, 2017)
definition: "Se refiere a la religión protestante centrada en torno a la creencia que el sacramento del bautismo debería ser administrado sólo a miembros adultos tras una manifestación personal de creencia en Jesucristo. El bautismo en esta fe es usualmente hecho por inmersión total. El énfasis es puesto en las Escrituras Bíblicas y la oración. La denominación baptista deriva principalmente de la Inglaterra y Gales del siglo XVII en donde rápidamente se difundió a pesar que hay algunas conexiones con los Anabaptistas del siglo XVI. La iglesia baptista creció rápidamente en el siglo XIX en los Estados Unidos." (Getty, 2017) @es
definition: "Verwijst naar een protestantse gezindte waarbij het geloof centraal staat dat het sacrament van de doop alleen moet worden toegediend aan volwassen leden na een persoonlijke belijdenis van geloof in Jezus Christus. De doop vindt bij deze gezindte doorgaans plaats door volledige onderdompeling. De nadruk ligt op Bijbelse geschriften en preken. Het baptisme is in hoofdzaak ontstaan in de vroege 17de eeuw in Engeland en Wales waar het zich snel verspreidde, hoewel er enige verbanden zijn met de anabaptisten van de 16de eeuw. In de late 19de eeuw nam het aantal baptistische kerken in de Verenigde Staten snel toe." (Getty, 2017) @nl
definition: "一支新教派別，相信只有親自聲明信仰基督的成人才可受洗。此教的洗禮通常需全身浸洗。重視聖經經文與佈道。浸信會與十六世紀的重浸派有些淵源，但主要源於十七世紀初的英格蘭與威爾斯，在這兩處快速廣傳。其教會於十九世紀末在美國急速增加。" (Getty, 2017) @zh-hant
in scheme: religion

Bengali
in dataset: The CWRC Ontology
type: ethnicity
type: Concept
label: bengali @fr
definition: "The Bengalis (বাঙালি Bangali), also spelled as the Bangalees, are a major Indo-Aryan ethnic group. They are native to the region of Bengal in South Asia, which is presently-divided between Bangladesh and the Indian state of West Bengal. They speak the Bengali language, the most easterly branch of the Indo-European language family. Bengalis are the third largest ethnic group in the world after the Han Chinese and the Arabs. They have four major religious subgroups, including Bengali Muslims, Bengali Hindus, Bengali Christians and Bengali Buddhists." (DBpedia, 2017)
definition: «Les Bengalis (Bengali: বাঙালি Bangali) sont le principal groupe ethnique de la région du Bengale partagée entre le Bangladesh et l'Inde. Les langues Bengalis sont les principales langues maternelles des Bengalis. Ils sont majoritaires au Bangladesh et dans les États du Bengale-Occidental et de Tripura d'Inde. Ils représentent quelque 150 millions d'individus au Bangladesh, 70 millions en Inde, 3 millions au Pakistan et forment d'importantes minorités d'Arabie Saoudite et des Émirats arabes unis. Environ 65 % des Bengalis sont Musulmans, 34 % Hindous, et moins de 1% sont de diverses confessions (dont Chrétiens). Les Bengalis Musulmans vivent principalement au Bangladesh, ou ils constituent plus de 80 % des croyants. Le reste des Bengalis, Hindous, vivent en Inde, surtout au Bengale-occidental. Au Bangladesh, entre 11 et 15% de la population Bengalie est Hindoue.» (DBpedia, 2017) @fr
in scheme: ethnicity

The cwrc ontology bibliography
in dataset: The CWRC Ontology
type: Collection
label: La bibliographie de l'ontologie cwrc @fr

birth control activist
in dataset: The CWRC Ontology
type: political affiliation
type: Concept
value: birth control campaigner
value: birth-control activist
value: contraceptionist
value: pro birth control
value: pro-birth control
value: pro-contraception
comment: The description for this term is indebted to DBpedia.
label: birth control activism
label: défense du contrôle des naissances @fr
broader transitive: progressivism
definition: Promotion of birth control awareness, practices, and resources. See: Birth control movement in the United States - Wikipedia. Also see:Category:Birth control - Wikipedia
definition: Sensibilisation sur le contrôle des naissances, à travers les savoirs, les pratiques et les ressources qui y sont liées. Voir Contrôle des naissances — Wikipédia @fr
in scheme: political affiliation
related: activist for women and children
related: pro-choice
related: sex-trade activist

blackwoman
is replaced by: blackwoman
in dataset: The CWRC Ontology
comment: Deprecated in favour of instance black.
comment: Désapprouver en faveur de l'instance noir. @fr
label: black (race)
label: noir (race) @fr
deprecated: true
term status: deprecated

anti-segregationist
in dataset: The CWRC Ontology
type: political affiliation
type: Concept
value: black activist
value: black liberation
value: black liberationist
value: black power
value: black pride
comment: The description for this term is indebted to DBpedia.
label: black anti-oppression movement
label: mouvement contre l'oppression des Noirs @fr
broader transitive: civil rights
broader transitive: activist for racial equality
definition: Opposition to the social, institutional, and political oppression of people defined as black, which varies historically and geographically. See Racism in the United Kingdom - Wikipedia and African-American civil rights movement (1954–1968) - Wikipedia
definition: Opposition à l'oppression sociale, institutionnelle et politique des personnes identifiées comme noires, qui diffère selon le contexte historique et géographique. Voir Racisme en France — Wikipédia et Mouvement afro-américain des droits civiques — Wikipédia @fr
in scheme: political affiliation
related: abolition

black
in dataset: The CWRC Ontology
type: ethnicity
type: Thing
type: Concept
label: noir @fr
broader: black identity
definition: "Black people (seen both capitalized and with lowercase 'b') is a term used in certain countries, often in socially based systems of racial classification or of ethnicity, to describe persons who are perceived to be dark-skinned compared to other given populations. As such, the meaning of the expression varies widely both between and within societies, and depends significantly on context. For many other individuals, communities and countries, "black" is also perceived as a derogatory, outdated, reductive or otherwise unrepresentative label, and as a result is neither used nor defined. Different societies apply differing criteria regarding who is classified as "black", and these social constructs have also changed over time. In a number of countries, societal variables affect classification as much as skin color, and the social criteria for "blackness" vary. For example, in North America the term black people is not necessarily an indicator of skin color or ethnic origin, but is instead a socially based racial classification related to being African American, with a family history associated with institutionalized slavery. In South Africa and Latin America, mixed-race people are generally not classified as "black". In other regions such as Australasia, settlers applied the term "black" or it was used by local populations with different histories and ancestral backgrounds." (DBpedia, 2017)
definition: «La catégorie Noir(e) est généralement employée en français pour distinguer un être humain ayant la peau foncée. S'il désigne souvent des êtres humains originaires d'Afrique subsaharienne, ce terme peut être utilisé pour qualifier des personnes asiatiques (Papous...) ou océaniennes (Aborigènes…). Les études scientifiques, fondées depuis le milieu du xxe siècle sur la génétique, ont affirmé que le concept de race n'est pas pertinent pour caractériser les différents sous-groupes géographiques de l'espèce humaine car la variabilité génétique entre individus d'un même sous-groupe est plus importante que la variabilité génétique moyenne entre sous-groupes géographiques. Le consensus scientifique actuel rejette en tout état de cause la présence d'arguments biologiques pour légitimer la notion de race, reléguée à une représentation arbitraire selon des critères morphologiques, ethnico-sociaux, culturels ou politiques, comme les identités. D'un point de vue biologique la peau foncée est un épiderme qui comporte un fort taux de mélanine, c'est donc une adaptation génétique issue de la sélection naturelle permettant une protection face aux radiations UV dans les milieux fortement ensoleillés. Ces milieux sont moins soumis au risque de carence en vitamine D à l'inverse des pays faiblement ensoleillés dans lesquels les individus ont la peau claire.» (DBpedia, 2017) @fr
in scheme: ethnicity

black identity
in dataset: The CWRC Ontology
has literal form: black
has literal form: noir @fr
type: textual label
type: Concept
label: identité noir @fr
one of: black
one of: blackwoman
definition: A subclass of textual label, this discursive label reflects the ambiguity of blackness associated with different cultural forms. It provides a means of aggregating and searching multiple instances of "Black" (e.g. black, black) cultural identities.
in scheme: textual label
name: black

blackwoman
in dataset: The CWRC Ontology
type: race or colour
type: Thing
type: Concept
label: black
label: noir @fr
broader: black identity
definition: "Black people (seen both capitalized and with lowercase 'b') is a term used in certain countries, often in socially based systems of racial classification or of ethnicity, to describe persons who are perceived to be dark-skinned compared to other given populations. As such, the meaning of the expression varies widely both between and within societies, and depends significantly on context. For many other individuals, communities and countries, 'black' is also perceived as a derogatory, outdated, reductive or otherwise unrepresentative label, and as a result is neither used nor defined. Different societies apply different criteria regarding who is classified as 'black', and these social constructs have also changed over time. In a number of countries, societal variables affect classification as much as skin color, and the social criteria for 'blackness' vary. For example, in North America the term black people is not necessarily an indicator of skin color or ethnic origin, but is instead a socially based racial classification related to being African American, with a family history associated with institutionalized slavery. In South Africa and Latin America, mixed-race people are generally not classified as 'black'. In other regions such as Australasia, settlers applied the term 'black' or it was used by local populations with different histories and ancestral backgrounds." (DBpedia, 2017)
definition: «La catégorie Noir(e) est généralement employée en français pour distinguer un être humain ayant la peau foncée. S'il désigne souvent des êtres humains originaires d'Afrique subsaharienne, ce terme peut être utilisé pour qualifier des personnes asiatiques (Papous...) ou océaniennes (Aborigènes...). Les études scientifiques, fondées depuis le milieu du xxe siècle sur la génétique, ont affirmé que le concept de race n'est pas pertinent pour caractériser les différents sous-groupes géographiques de l'espèce humaine car la variabilité génétique entre individus d'un même sous-groupe est plus importante que la variabilité génétique moyenne entre sous-groupes géographiques. Le consensus scientifique actuel rejette en tout état de cause la présence d'arguments biologiques pour légitimer la notion de race, reléguée à une représentation arbitraire selon des critères morphologiques, ethnico-sociaux, culturels ou politiques, comme les identités. D'un point de vue biologique la peau foncée est un épiderme qui comporte un fort taux de mélanine, c'est donc une adaptation génétique issue de la sélection naturelle permettant une protection face aux radiations UV dans les milieux fortement ensoleillés. Ces milieux sont moins soumis au risque de carence en vitamine D à l'inverse des pays faiblement ensoleillés dans lesquels les individus ont la peau claire.» (DBpedia, 2017) @fr
in scheme: race or colour
name: black (race colour)

blood relative of
in dataset: The CWRC Ontology
type: DeprecatedProperty
comment: Deprecated, with no current equivalence, in favour of definition of family relationships as more fluid and expansive than blood relations.
comment: Désapprouver sans équivalence. @fr
label: liens de sang @fr
sub property of: FAMILY
deprecated: true
term status: deprecated

Bolshevist
in dataset: The CWRC Ontology
type: political affiliation
type: Concept
value: pro-bolshevik
comment: La description de ce terme est basée sur celle de DBPedia. @fr
comment: The description for this term is indebted to DBpedia.
label: Bolcheviks @fr
label: Bolshevism
definition: "Les bolcheviks, bolcheviques ou bolchéviques sont les membres d'une fraction du Parti ouvrier social-démocrate de Russie, créée en 1903 sous la direction de Lénine, devenue un parti indépendant en 1912. Après la révolution russe de février 1917, les bolcheviks prennent le pouvoir au nom des soviets en octobre 1917 dans le cadre de la République socialiste fédérative soviétique de Russie. En 1918, le Parti bolchévique est renommé Parti communiste. Après la mise en place de l'URSS (1922), il devient le Parti communiste de l'Union soviétique (PCUS), ajoutant jusqu'en 1952 à ce nom l'adjectif bolchevik (placé entre parenthèses)." (DBpedia, 2017) @fr
definition: "The Bolsheviks, originally also Bolshevists or Bolsheviki (Russian: большевики, большевик (singular); IPA: [bəlʲʂɨˈvʲik]; derived from большинство bol'shinstvo, "majority", literally meaning "one of the majority") were a faction of the Marxist Russian Social Democratic Labour Party (RSDLP) which split apart from the Menshevik faction at the Second Party Congress in 1903. The RSDLP was a revolutionary socialist political party formed in 1898 in Minsk to unite the various revolutionary organisations of the Russian Empire into one party. In the Second Party Congress vote, the Bolsheviks won on the majority of important issues, hence their name. They ultimately became the Communist Party of the Soviet Union. The Bolsheviks or Reds came to power in Russia during the October Revolution phase of the Russian Revolution of 1917, and founded the Russian Soviet Federative Socialist Republic (RSFSR). With the Reds defeating the Whites, and others during the Russian Civil War of 1917–1922, the RSFSR became the chief constituent of the Soviet Union in December 1922. The Bolsheviks, founded by Vladimir Lenin and Alexander Bogdanov, were by 1905 a major organisation consisting primarily of workers under a democratic internal hierarchy governed by the principle of democratic centralism, who considered themselves the leaders of the revolutionary working class of Russia. Their beliefs and practices were often referred to as Bolshevism." (DBpedia, 2017)
in scheme: political affiliation
related: christian communist

pro-bonapartist
in dataset: The CWRC Ontology
type: political affiliation
type: Concept
comment: La description de ce terme est basée sur celle de DBPedia. @fr
comment: The description for this term is indebted to DBpedia.
label: Bonapartism
label: Bonapartisme @fr
definition: "Bonapartism is the political ideology of Napoleon Bonaparte and his followers and successors. It was later used to refer to persons who hoped to restore the House of Bonaparte and its style of government. After Napoleon, the term was applied to the French politicians who seized power in the coup of 18 Brumaire, ruling in the French Consulate and subsequently in the First and Second French Empires under the House of Bonaparte (the family of Bonaparte and his nephew Louis). The term was used more generally for a political movement that advocated a dictatorship or authoritarian centralized state, with a strongman charismatic leader based on anti-elitist rhetoric, army support, and conservatism. Marxism and Leninism developed a vocabulary of political terms that included Bonapartism, derived from their analysis of the career of Napoleon Bonaparte. Karl Marx was a student of Jacobinism and the French Revolution, and was a contemporary critic of the Second Republic and Second Empire. He used "Bonapartism" to refer to a situation in which counter-revolutionary military officers seize power from revolutionaries, and use selective reforms to co-opt the radicalism of the popular classes. Marx argued that in the process, Bonapartists preserve and mask the power of a narrower ruling class. According to his essay "The Eighteenth Brumaire of Louis Napoleon" (1852), Marx believed that both Bonaparte and his nephew Napoleon III had corrupted revolutions in France in this way. In this document, he drew attention to what he calls the phenomenon's repetitive history by saying: "History repeats itself, first as tragedy, then as farce." More generally, "Bonapartism" may be used to describe the replacement of civilian leadership by military leadership within revolutionary movements or governments. Many modern-day Trotskyists and other leftists use the phrase "left Bonapartist" to describe those, such as Stalin and Mao, who controlled 20th-century bureaucratic socialist regimes. In addit…
definition: Le bonapartisme est une famille de pensée politique française, qui s'inspire de l'action de l'empereur Napoléon Ier. Le terme a deux acceptions : * au sens strict, le bonapartisme vise à établir un régime républicain impérial en France à la tête duquel serait placé un membre de la famille de Napoléon Bonaparte ; * au sens large, le" bonapartisme vise à établir un État national à exécutif fort et centralisé mais d'essence républicaine et assis sur la consultation régulière du peuple par le biais de plébiscites. Le bonapartisme n'implique donc pas forcément l'adhésion à un système d'organisation politique héréditaire mais peut au contraire s'accommoder d'une forme républicaine de gouvernement. Il repose sur la fusion des élites et l'adhésion populaire. Ces deux facettes peuvent être distinctes ou confondues, selon les personnes et périodes." (DBpedia, 2017) @fr
in scheme: political affiliation

boulangist
in dataset: The CWRC Ontology
type: political affiliation
type: Concept
comment: The description for this term is indebted to DBpedia.
label: Boulangisme @fr
label: boulangism
definition: Followed the three principles of "revenge on Germany", "revision of the constitution", and "the return to monarchy" in frustration with French conservatism. Based on the politics of Georges Ernest Boulanger. See: Georges Ernest Boulanger - Wikipedia
definition: Mouvement politique suivant trois principes qui sont la revenge contre l'Allemagne, la révision de la constitution et le retour à la monarchie, en réponse à la frustration provoquée par le régime conservateur français. S'appuie sur les idées politiques du général Georges Ernest Boulanger. Voir Boulangisme — Wikipédia @fr
in scheme: political affiliation

british nationalist
in dataset: The CWRC Ontology
type: political affiliation
type: Concept
comment: The description for this term is indebted to DBpedia.
label: British nationalism
label: nationalisme anglais @fr
broader transitive: nationalism
definition: "British nationalism asserts that the British are a nation and promotes the cultural unity of the British, in a definition of Britishness that may include people of English, Scottish, Welsh, Ulster, Scots and Irish descent. British nationalism is closely associated with British unionism, which seeks to uphold the political union that is the United Kingdom, or strengthen the links between the countries of the United Kingdom. British nationalism's unifying identity descends from the ancient Britons who dwelt on the island of Great Britain. British nationalism grew to include people outside Great Britain, in Ireland, because of the 1542 Crown of Ireland Act, which declared that the crown of Ireland was to be held by the ruling monarch of England as well as Anglo-Irish calls for unity with Britain. It is characterised as a "powerful but ambivalent force in British politics". In its moderate form, British nationalism has been a civic nationalism, emphasising both cohesion and diversity of the people of the United Kingdom, its dependencies, and its former colonies. Recently however, nativist nationalism has arisen based on fear of Britain being swamped by immigrants; this anti-immigrant nativist nationalism has manifested politically in the British National Party and other nativist nationalist movements. Politicians, such as British Prime Minister David Cameron of the Conservative Party and his direct predecessor Gordon Brown of the Labour Party, have sought to promote British nationalism as a progressive cause." (DBpedia, 2017)
in scheme: political affiliation

BROTHER
in dataset: The CWRC Ontology
type: ObjectProperty
label: brother of
label: frère de @fr
sub property of: SIBLING

Buddhism
in dataset: The CWRC Ontology
type: religion
type: Concept
comment: La description de ce terme est basée sur celle de DBPedia. @fr
comment: The description for this term is indebted to the Getty Art & Architecture Thesaurus.
label: Boeddhisme @nl
label: Bouddhisme @fr
label: Budismo @es
label: fo chiao @zh-latn
label: fo jiao @zh-latn
label: fó jiào @zh-latn
label: 佛教 @zh-hant
alternative label: Buddhist
definition: "Le bouddhisme est, selon les points de vue en Occident, une religion (notamment une religion d'État) ou une philosophie, voire les deux, dont les origines remontent en Inde au Ve siècleav. J.-C. à la suite de l'éveil de Siddhartha Gautama et de son enseignement. Le bouddhisme comptait en 2005 entre 230 millions et 500 millions d'adeptes, ce qui en fait la quatrième religion mondiale, derrière (dans l'ordre décroissant) le christianisme, l'islam, et l'hindouisme. Le bouddhisme présente un ensemble ramifié de pratiques méditatives, de pratiques éthiques, de théories psychologiques, philosophiques, cosmogoniques et cosmologiques, abordées dans la perspective de la bodhi, «l'éveil». À l'instar du jaïnisme, le bouddhisme est à l'origine une tradition shramana, et non brahmanique comme l'est l'hindouisme. Les notions de dieu et de divinité dans le bouddhisme sont particulières : bien que le bouddhisme soit souvent perçu comme une religion sans dieu créateur, la notion étant absente de la plupart des formes du bouddhisme, la vénération et le culte du Bouddha historique Siddhartha Gautama en tant que bhagavat joue un rôle important dans le Theravāda et également dans le Mahāyāna, dans lesquels il est un être éveillé ayant trois aspects ou manifestations (trikāya)." (DBpedia, 2017) @fr
definition: "Refers to the philosophy and religion based on the enlightenment and teachings of the Buddha Gautama in the early sixth century BCE in the northeastern region of modern India. Playing dominant roles in the art and culture of Southeast Asia and East Asia, this religion is based on the transcendence of human suffering and pain through the acceptance of the limitations of individuality, the surrender of worldly desires and cravings that cause disappointment and sorrow, and the deliverance from the impermanence of living and individual ego based on wealth, social position, or family through the process of enlightenment (nirvana). The religion also centers around 'anatman', or no-self, the idea that the self is in a state of action or a series of changing manifestations rather than in a state of fixed, metaphysical substance. The structure of the religion is based on the Triratna ("Three Jewels" of Buddha), a tripartite schematic for living based on three elements: Buddha (the teacher), dharma (the teaching), and sangha (community)." (Getty, 2017)
definition: "Se refiere a la filosofía y religión basada en la iluminación y enseñanza del Buddha Gautama en el siglo VI a.C temprano en la región nordeste de la India Moderna. Jugando un rol dominante en el arte y la cultura del Asia Sudeste y Asia Oriental, esta religión está basada en la trascendencia del sufrimiento y dolor humano a través de la aceptación de las limitaciones de individualidad, la rendición de deseos mundanos y anhelos que causan desilusión y aflicción y la liberación desde la transitoriedad of living and individual ego based on wealth, social position, or family through the process of enlightenment (nirvana). The religion also centers around anatman, or no-self, the idea that the self is in a state of action or a series of changing manifestations rather than in a state of fixed, metaphysical substance. The structure of the religion is based on the Triratna ("Three Jewels" of Buddha), a tripartite schematic for living based on three elements: Buddha (the teacher), dharma (the teaching), and sangha (community)." (Getty, 2017) @es
definition: "Verwijst naar de filosofie en religie die zijn gebaseerd op de verlichting en leer van Boeddha Gautama in de vroege 6de eeuw v. Chr. in het Noord-Oosten van het moderne India. Deze religie, die een dominante rol speelt in de kunst en cultuur van Zuidoost-Azië en Oost-Azië, is gebaseerd op het overstijgen van menselijk lijden en pijn door het accepteren van de grenzen van de individualiteit, het opgeven van wereldse verlangens en wensen die voor teleurstellingen en verdriet zorgen en het loslaten van het niet-permanente van het leven en het afzonderlijke ego met de bijbehorende welvaart, sociale positie of familierelaties, allemaal door het proces van de verlichting (nirvana). Bij deze religie staat ook 'anatman' centraal, het idee dat 'het zelf' altijd in ontwikkeling is of deel uitmaakt van een reeks veranderende verschijningsvormen in plaats van een vaste, metafysische substantie. De structuur van de religie is gebaseerd op de Triratna ('drie juwelen' van boeddha), een drieledige structuur voor het leven gebaseerd op drie elementen: boeddha (de leraar), dharma (de leer) en sangha (de gemeenschap)." (Getty, 2017) @nl
definition: "根據釋迦牟尼佛之開悟與教誨的哲學和宗教，在西元前六世紀初起源於現今印度東北部。佛教於東南亞及東亞的藝術與文化層面扮演主要角色，相信透過接受自身的局限，以及放棄會引起失望與悲傷的世俗欲求及渴望，能夠使人類的苦痛得以昇華，而在開悟（涅盤）過程中得以從短暫的生命以及建築在財富、社會地位與家庭上的個人自尊中獲得解脫。此宗教的中心思想為「無我」，認為自我是處於活動狀態或是一連串的形式改變，而非固定的形上實體狀態。佛教的架構奠基於「三寶」，即生命三元素：佛(老師)、法(規範)、僧(眾)。" (Getty, 2017) @zh-hant
in scheme: religion

capitalism
in dataset: The CWRC Ontology
type: political affiliation
type: Concept
value: capitalist
value: free market capitalism
comment: La description de ce terme est basée sur celle de DBPedia. @fr
comment: The description for this term is indebted to DBpedia.
label: capitalisme @fr
definition: Capitalism is an economic system based on private ownership of the means of production and their operation for profit. Characteristics central to capitalism include private property, capital accumulation, wage labor, voluntary exchange, a price system, and competitive markets. In a capitalist market economy, decision-making and investment is determined by the owners of the factors of production in financial and capital markets, and prices and the distribution of goods are mainly determined by competition in the market. Economists, political economists, and historians have adopted different perspectives in their analyses of capitalism and have recognized various forms of it in practice. These include laissez-faire or free market capitalism, welfare capitalism, and state capitalism. Different forms of capitalism feature varying degrees of free markets, public ownership, obstacles to free competition, and state-sanctioned social policies. The degree of competition in markets, the role of intervention and regulation, and the scope of state ownership vary across different models of capitalism;the extent to which different markets are free, as well as the rules defining private property, are matters of politics and of policy. Most existing capitalist economies are mixed economies, which combine elements of free markets with state intervention, and in some cases, with economic planning. Capitalism has existed under many forms of government, in many different times, places, and cultures. Following the decline of mercantilism, mixed capitalist systems became dominant in the Western world and continue to spread See: Capitalism - Wikipedia
definition: Le capitalisme est un concept à la fois économique, sociologique et politique qui caractérise un système s'appuyant sur la propriété privée des moyens de production. Sa définition donne lieu à des variations dans l'espace et dans le temps, et en fonction des sensibilités politiques des personnes qui emploient le terme. On considère généralement que ses fondements sont l'accumulation du capital productif et la réalisation du profit. Voir Capitalisme — Wikipédia @fr
in scheme: political affiliation

Roman Catholic
is replaced by: Roman Catholicism
in dataset: The CWRC Ontology
type: Concept
comment: Deprecated in favour of instance Roman Catholicism.
comment: Désapprouver en faveur de l'instance Catholicisme. @fr
comment: La description de ce terme est basée sur celle de DBPedia. @fr
comment: The description for this term is indebted to the Getty Art & Architecture Thesaurus.
label: Catholicisme @fr
label: Catolicismo @es
label: Catolicismo Romano @es
label: Katholicisme @nl
label: Katholiek @nl
label: Rooms-Katholicisme @nl
deprecated: true
term status: deprecated
broader transitive: Christianity
definition: "L’Église catholique, ou Église catholique, apostolique et romaine, est la plus grande Église chrétienne avec plus d'un milliard de fidèles. Elle réunit l’ensemble des chrétiens en communion avec le pape et les évêques qui sont considérés par les catholiques comme étant les successeurs des apôtres de Jésus-Christ. L'Église catholique est l'une des plus vieilles institutions religieuses au monde et a joué un rôle important dans l'histoire, surtout du monde occidental. La foi de l'Église catholique est résumée par le symbole de Nicée et elle se caractérise par la célébration des sept sacrements dont le plus important est l'Eucharistie célébré liturgiquement durant la messe. Selon son propre catéchisme, l'Église catholique est composée de trois parties qui ne forment qu'une seule Église placée sous Jésus-Christ : l'Église militante, l'Église triomphante et l'Église souffrante correspondant respectivement à l'ensemble des fidèles sur terre, l'ensemble des saints qui sont au ciel et l'ensemble des âmes qui sont au purgatoire. L'Église catholique sur terre se conçoit comme une communion d'Églises locales ou particulières, c'est-à-dire ayant chacune un territoire et un évêque à sa tête. Celles-ci sont chacune pleinement l'Église catholique dans la mesure où elles sont en communion avec le pape, qui est l'évêque de Rome et considéré comme étant le successeur de saint Pierre, et en communion les unes avec les autres. L'Église catholique se définit comme une institution à la fois humaine et divine : «société parfaite en dépit de l'imperfection de ses membres». En plus d'être l'ensemble des baptisés, elle est aussi une institution et un clergé organisés de façon hiérarchique. Une très grande majorité des catholiques (au moins 98 %) sont de l'Église latine, mais il existe aussi des catholiques de différentes Églises catholiques orientales." (DBpedia, 2017) @fr
definition: "Refers to the branch of Christianity characterized by a uniform, highly developed ritual canon and organisational structure with doctrinal roots based in the teachings of the Apostles of Jesus Christ in the first century, in the Alexandrian school of theology, and in Augustinian thought. In this religious branch, faith is considered an acceptance of revelation; revelation appears as doctrine. In juridical terms, it refers to the branch of Christianity distinguished as a unified, monolithic sacramental system under the governance of papal authority. Throughout much of its history, the seat of the Pope has been in Rome, thus "Roman Catholicism" is often used to distinguish this concept from the Orthodox Catholic church." (Getty, 2017)
definition: "Se refiere a la rama del cristianismo caracterizada por un canon ritual uniforme y altamente desarrollado y una estructura organizacional con raíces doctrinales basadas en las enseñanzas de los Apostoles de Jesucristo en la primera centuria, en la Escuela Alejandrina de teología, y en el pensamiento agustiniano. En esta rama de la religión, la fe es considerada como una aceptación de revelación; la revelación aparece como doctrina. Se refiere a la rama del cristianismo caracterizada por un canon ritual uniforme y altamente desarrollado y una estructura organizacional con raíces doctrinales basadas en las enseñanzas de los Apóstoles de Jesucristo en el primer siglo, en la Escuela Alejandrina de teología, y en el pensamiento agustiniano. En esta rama de la religión, la fe es considerada como una aceptación de revelación; la revelación aparece como doctrina. En términos jurídicos, se refiere a la rama del Cristianismo distinguido como sistema sacramental unificado, monolítico bajo gobierno de la autoridad papal. A través de la mayor parte de su historia, "la silla del papal" ha estado en Roma, mediante este concepto el Catolicismo Romano se distingue de la Iglesia Católica Ortodoxa." (Getty, 2017) @es
definition: "Verwijst naar de richting van het christendom die zich kenmerkt door een uniforme, hoogontwikkelde rituele canon en organisatiestructuur met een doctrine die wortelt in de leer van de apostelen van Jezus Christus in de 1ste eeuw, in de theologie van de Alexandrijnse school en in het augustijner gedachtegoed. In deze godsdienstige richting wordt het geloof beschouwd als een aanvaarding van de openbaring; de openbaring heeft de vorm van een doctrine. In juridische zin verwijst de term naar de richting van het christendom die zich onderscheidt als een verenigd, monolithisch sacramenteel systeem onder het bestuur van het pauselijk gezag. Gedurende het grootste deel van de geschiedenis van dit systeem was de paus gevestigd in Rome en daarom wordt 'rooms-katholicisme' vaak gebruikt om dit begrip te onderscheiden van de orthodoxe katholieke kerk." (Getty, 2017) @nl
in scheme: religion

Roman Catholicism
in dataset: The CWRC Ontology
type: religion
type: Concept
comment: La description de ce terme est basée sur celle de DBPedia. @fr
comment: The description for this term is indebted to the Getty Art & Architecture Thesaurus.
label: Catholicisme @fr
label: Catolicismo @es
label: Catolicismo Romano @es
label: Katholicisme @nl
label: Katholiek @nl
label: Rooms-Katholicisme @nl
broader transitive: Christianity
definition: "L’Église catholique, ou Église catholique, apostolique et romaine, est la plus grande Église chrétienne avec plus d'un milliard de fidèles. Elle réunit l’ensemble des chrétiens en communion avec le pape et les évêques qui sont considérés par les catholiques comme étant les successeurs des apôtres de Jésus-Christ. L'Église catholique est l'une des plus vieilles institutions religieuses au monde et a joué un rôle important dans l'histoire, surtout du monde occidental. La foi de l'Église catholique est résumée par le symbole de Nicée et elle se caractérise par la célébration des sept sacrements dont le plus important est l'Eucharistie célébré liturgiquement durant la messe. Selon son propre catéchisme, l'Église catholique est composée de trois parties qui ne forment qu'une seule Église placée sous Jésus-Christ : l'Église militante, l'Église triomphante et l'Église souffrante correspondant respectivement à l'ensemble des fidèles sur terre, l'ensemble des saints qui sont au ciel et l'ensemble des âmes qui sont au purgatoire. L'Église catholique sur terre se conçoit comme une communion d'Églises locales ou particulières, c'est-à-dire ayant chacune un territoire et un évêque à sa tête. Celles-ci sont chacune pleinement l'Église catholique dans la mesure où elles sont en communion avec le pape, qui est l'évêque de Rome et considéré comme étant le successeur de saint Pierre, et en communion les unes avec les autres. L'Église catholique se définit comme une institution à la fois humaine et divine : «société parfaite en dépit de l'imperfection de ses membres». En plus d'être l'ensemble des baptisés, elle est aussi une institution et un clergé organisés de façon hiérarchique. Une très grande majorité des catholiques (au moins 98 %) sont de l'Église latine, mais il existe aussi des catholiques de différentes Églises catholiques orientales." (DBpedia, 2017) @fr
definition: "Refers to the branch of Christianity characterized by a uniform, highly developed ritual canon and organisational structure with doctrinal roots based in the teachings of the Apostles of Jesus Christ in the first century, in the Alexandrian school of theology, and in Augustinian thought. In this religious branch, faith is considered an acceptance of revelation; revelation appears as doctrine. In juridical terms, it refers to the branch of Christianity distinguished as a unified, monolithic sacramental system under the governance of papal authority. Throughout much of its history, the seat of the Pope has been in Rome, thus "Roman Catholicism" is often used to distinguish this concept from the Orthodox Catholic church." (Getty, 2017)
definition: "Se refiere a la rama del cristianismo caracterizada por un canon ritual uniforme y altamente desarrollado y una estructura organizacional con raíces doctrinales basadas en las enseñanzas de los Apostoles de Jesucristo en la primera centuria, en la Escuela Alejandrina de teología, y en el pensamiento agustiniano. En esta rama de la religión, la fe es considerada como una aceptación de revelación; la revelación aparece como doctrina. Se refiere a la rama del cristianismo caracterizada por un canon ritual uniforme y altamente desarrollado y una estructura organizacional con raíces doctrinales basadas en las enseñanzas de los Apóstoles de Jesucristo en el primer siglo, en la Escuela Alejandrina de teología, y en el pensamiento agustiniano. En esta rama de la religión, la fe es considerada como una aceptación de revelación; la revelación aparece como doctrina. En términos jurídicos, se refiere a la rama del Cristianismo distinguido como sistema sacramental unificado, monolítico bajo gobierno de la autoridad papal. A través de la mayor parte de su historia, "la silla del papal" ha estado en Roma, mediante este concepto el Catolicismo Romano se distingue de la Iglesia Católica Ortodoxa." (Getty, 2017) @es
definition: "Verwijst naar de richting van het christendom die zich kenmerkt door een uniforme, hoogontwikkelde rituele canon en organisatiestructuur met een doctrine die wortelt in de leer van de apostelen van Jezus Christus in de 1ste eeuw, in de theologie van de Alexandrijnse school en in het augustijner gedachtegoed. In deze godsdienstige richting wordt het geloof beschouwd als een aanvaarding van de openbaring; de openbaring heeft de vorm van een doctrine. In juridische zin verwijst de term naar de richting van het christendom die zich onderscheidt als een verenigd, monolithisch sacramenteel systeem onder het bestuur van het pauselijk gezag. Gedurende het grootste deel van de geschiedenis van dit systeem was de paus gevestigd in Rome en daarom wordt 'rooms-katholicisme' vaak gebruikt om dit begrip te onderscheiden van de orthodoxe katholieke kerk." (Getty, 2017) @nl
in scheme: religion

Highland
in dataset: The CWRC Ontology
type: ethnicity
type: Concept
value: Highland (that is Celtic)
label: Celte @fr
label: Celtic
definition: "A modern Celtic identity emerged in Western Europe following the identification of the native peoples of the Atlantic fringe as Celts by Edward Lhuyd in the 18th century. Lhuyd and others equated the Celts described by Greco-Roman writers with the pre-Roman peoples of France, Great Britain and Ireland. The Irish and ancient British languages were thus Celtic languages. The descendants of these languages were the Brittonic (Breton, Cornish and Welsh variants) and Gaelic (Irish, Manx and Scottish variants) languages. These peoples were therefore modern Celts. Attempts were made to link their distinctive cultures to those of the Ancient Celtic people." (DBpedia, 2017)
definition: «Les Celtes constituent une civilisation protohistorique qui se définit par l'usage de langues celtiques et par certains particularismes culturels. Ils ont jadis été présents sur une grande partie du continent européen et en Asie mineure. L'apogée de l'expansion celte se situe entre le viiie siècle av. J.-C. et le iiie siècle, marqué notamment par la civilisation laténienne au ve siècle av. J.-C. Une succession de conquêtes et de migrations les mènent jusqu'en Galatie, en Asie mineure. Ainsi, leur domination s'étendait dans l'Europe actuelle de Galice jusqu'à Galați.» (DBpedia, 2017) @fr
in scheme: ethnicity

CHILD
in dataset: The CWRC Ontology
type: ObjectProperty
label: child of
label: enfant de @fr
sub property of: FAMILY

campaigner against child prostitution
in dataset: The CWRC Ontology
type: political affiliation
type: Concept
value: children's rights
value: children's rights activist
value: children's rights advocate
comment: The description for this term is indebted to DBpedia.
label: children's welfare
label: défense des droits des enfants @fr
broader transitive: human rights activist
definition: Advocacy or activism for the rights or welfare of children. See: Category:Child welfare - Wikipedia
definition: Militantisme et activisme pour les droits et le bien-être des enfants. Voir Droits de l'enfant — Wikipédia @fr
in scheme: political affiliation

christian pacifist
in dataset: The CWRC Ontology
type: political affiliation
type: Concept
comment: La description de ce terme est basée sur celle de DBPedia. @fr
comment: The description for this term is indebted to DBpedia.
label: Christian pacifism
label: Pacifisme chrétien @fr
broader transitive: pacifist
definition: "Christian pacifism is the theological and ethical position that any form of violence is incompatible with the Christian faith. Christian pacifists state that Jesus himself was a pacifist who taught and practiced pacifism and that his followers must do likewise. Notable Christian pacifists include Martin Luther King, Jr., Leo Tolstoy, and Ammon Hennacy. Hennacy believed that adherence to Christianity required not just pacifism but, because governments inevitably threatened or used force to resolve conflicts, anarchism. However, most Christian pacifists, including the peace churches, Christian Peacemaker Teams, and individuals such as John Howard Yoder, make no claim to be anarchists." (DBpedia, 2017)
definition: "Le pacifisme chrétien est un courant de pensée et d'action à l'intérieur du christianisme. Il désigne, a minima, le refus de la participation à la mise à mort d'un être humain à la guerre pour motif de conscience, et plus largement, le refus d'utiliser des moyens violents pour se défendre, parvenir à ses fins ou opposer une résistance. Bien qu'étant la position d'origine des premiers chrétiens , le pacifisme est considéré comme la position minoritaire au sein des Églises chrétiennes, la position dominante dans l'histoire de l'Église étant la doctrine de la guerre juste. Ce refus d'attenter à la vie de la personne humaine se fonde sur l'un ou plusieurs les aspects bibliques-théologiques suivants : l'être humain comme créature et image de Dieu à ne pas tuer (Ge 1.27 ; Ge 9.5-6)la parole du Décalogue (Ex 20,13) : «Tu ne tueras point», et l'extension de son champ d'applicationl'enseignement du Christ («Ne vous opposez pas [violemment] au mal» (Mt 5.39) ; «Aimez vos ennemis» (Mt 5.44)l'exemple de la vie du Christ (1 Pi 2.21-23)la mort du Christ interprétée comme don de soi et comme manière de répondre au mal (Rm 5.6-10)la résurrection du Christ vue comme la justification par Dieu de la manière de vivre du Messie (Phil 2.6-11)l'enseignement des apôtres («Soyez en paix avec tous» (Rm 12.18) ; «Sois vainqueur du mal par le bien» (Rm 12.21) Le pacifisme chrétien rejoint aujourd'hui l'ensemble de ce qui peut se désigner par le vocable de non-violence et qui se décline en dialogue, résolution de conflits, médiation, protestation non-violence, justice restaurative, etc. Le pacifisme chrétien et la non-violence sont notamment connu en milieu catholique à travers les efforts de pacification de la communauté de Sant'Egidio et les nombreuses missions diplomatiques de Jean-Paul II[réf. nécessaire]. Au sein du protestantisme, la résistance spirituelle au nazisme suscitée par le pasteur André Trocmé autour du Chambon-sur-Lignon, le combat de Martin Luther King pour les droits civique… @fr
in scheme: political affiliation

Christian Science
in dataset: The CWRC Ontology
type: religion
type: Concept
comment: La description de ce terme est basée sur celle de DBPedia. @fr
comment: The description for this term is indebted to the Getty Art & Architecture Thesaurus.
label: Christenwetenschap @nl
label: Ciencia Cristiana @es
label: Science Chrétienne @fr
broader transitive: Christianity
definition: "La Science chrétienne (ou Christian Science en anglais) se définit elle-même comme la «Science du Christ». Sa fondatrice, la théologienne américaine Mary Baker Eddy, estime avoir redécouvert en 1866 les lois appliquées par Jésus dans la guérison des malades et la résolution des aléas de la vie, lois toujours démontrables aujourd'hui. Son observation des guérisons et résolutions diverses obtenues sur la base de sa théorie en prouve, selon elle, la validité. Ainsi, la Science chrétienne est «chrétienne» en ce sens qu’elle repose sur les enseignements de Jésus de Nazareth, tels qu'exposés dans le Nouveau Testament. La Science chrétienne se veut une religion pratique permettant l'application de lois divines démontrables. Afin d'assurer la diffusion de cette science, Mary Baker Eddy fonde en 1879 une Église sans credo, appelée «Église du Christ, Scientiste» (en anglais The First Church of Christ, Scientist), rassemblant de nos jours 1 800 églises dans 82 pays et quelques centaines de milliers de pratiquants, principalement aux États-Unis. Reconnue comme association cultuelle dans de nombreux pays, notamment aux États-Unis, la Science chrétienne précise que, malgré la confusion possible entre les deux noms, elle n’a rien de commun avec l’Église de Scientologie; de plus, bien qu'elle partage nombre de concepts métaphysiques avec les églises de la Nouvelle Pensée comme Unité, la Science divine et la Science religieuse, ce qui amène certains historiens et sociologues à les aborder ensemble dans leurs travaux, la Science chrétienne et ces églises ne se reconnaissent pas mutuellement comme faisant partie de la même mouvance. La principale critique de la Science chrétienne est qu'elle a un caractère alternatif et non complémentaire au traitement médical. Ainsi, les guérisons alléguées sont obtenues en dehors de tout contrôle médical. Ses guérisons de maladies fonctionnelles ou organiques sont considérées comme relevant de l’effet placebo par les détracteurs de la Science chrét… @fr
definition: "Refers to a Christian denomination and movement founded by Mary Baker Eddy (1821-1910) that seeks to reinstate the Christian message of salvation from all evil, including sickness and disease as well as sin. Eddy, a semi-invalid who was interested in cures not involving medicine, claimed a recovery from a bad injury without medical assistance in 1866. Afterwards, she devoted herself to restoring the healing emphasis of early Christianity. In 1875 she finished writing the first edition of the 'Science and Health with Key to the Scriptures.' This work and the Bible are the principal texts of the movement and importance has been laid on establishing reading rooms where these works can make their own appeal to readers. The 'Christian Science Monitor' is also published by the denomination. Christian Science believes that ignorance is at the root of human unease and thus 'dis-ease.' Instead of seeking medical treatment, special Christian Science healers are to be consulted for spiritual healing. Health, happiness, and holiness can be restored by applying to all aspects of life practices and attitudes in keeping with the principal of divine harmony. The first Church of Christ, Scientist was founded in 1879 in Boston and its headquarters remain there." (Getty, 2017)
definition: "Se refiere a una secta y movimiento cristiano fundado por Mary Baker Eddy (1821-1910) que busca reincorporar el mensaje cristiano de salvación de todo mal, incluso la enfermedad y padecimiento así como el pecado. Eddy, un semi-inválido que estaba interesado en curas que no involucraran medicina, afirmó que se había recuperado de una lesión grave sin la ayuda médica en 1866. Después, se consagró a restaurar el énfasis curativo de la primera cristiandad. En 1875 ella terminó escribiendo la primera edición del "la Ciencia y Salud con Llave a las Escrituras". Este trabajo y la Biblia son los textos principales del movimiento y importancia se ha puesto en establecer salas de lectura donde estos trabajos pueden hacer su propia apelación a los lectores. El "Instructivo de ciencia cristiano" también fue publicado por la secta. La Ciencia Cristiana cree que la ignorancia es la raíz de los padecimientos humanos y por lo tanto de la enfermedad. En lugar de buscar tratamiento médico, los sanadores de la Ciencia Cristiana especiales serán consultados para la curación espiritual. La salud, felicidad, y santidad pueden ser restauradas aplicando a todos los aspectos de la vida prácticas y actitudes en concordancia con la armonía divina. La primera Iglesia Científica de Cristo, se fundó en 1879 en Boston y su centro principal permanece allí." (Getty, 2017) @es
definition: "Verwijst naar een christelijke gezindte en beweging die is gesticht door Mary Baker Eddy (1821-1910) en die streeft naar herbevestiging van de christelijke boodschap van verlossing van al het kwaad, met inbegrip van ziekte en zonde. Eddy, die half invalide was en geïnteresseerd in genezing zonder medicijnen, beweerde dat zij in 1866 zonder medische hulp was hersteld van zwaar letsel. Daarna wijdde zij zich aan het herstel van de nadruk op gebedsgenezing die het vroege christendom had gekenmerkt. In 1875 voltooide zij de eerste editie van haar boek 'Science and Health with Key to the Scriptures'. Dit werk en de Bijbel zijn de voornaamste geschriften van de beweging, die veel belang hecht aan de inrichting van leesruimten waar deze boeken een eigen beroep op de lezers kunnen doen. Ook de 'Christian Science Monitor' wordt door het kerkgenootschap uitgegeven. Volgens de leer van Christian Science is onwetendheid de wortel van het menselijk ongemak, de menselijke ziekte. In plaats van medische behandeling te zoeken moet men gebedsgenezers van Christian Science raadplegen voor spirituele genezing. Gezondheid, geluk en heiligheid kunnen worden hersteld door alle aspecten van de levenspraktijk en -houding aan te spreken in overeenstemming met het beginsel van goddelijke harmonie. De eerste Church of Christ, Scientist werd in 1879 in Boston gesticht en het hoofdkwartier van de beweging is daar nog altijd gevestigd." (Getty, 2017) @nl
in scheme: religion

christian socialist
in dataset: The CWRC Ontology
type: political affiliation
type: Concept
comment: The description for this term is indebted to DBpedia.
label: Christian socialism
label: socialisme chrétien @fr
broader transitive: militant socialist
definition: "Christian socialism is a form of religious socialism based on the teachings of Jesus of Nazareth. Many Christian socialists believe capitalism to be idolatrous and rooted in greed, which some Christian denominations consider a mortal sin. Christian socialists identify the cause of inequality to be the greed that they associate with capitalism. Christian socialism became a major movement in the United Kingdom beginning in the 1960s through the Christian Socialist Movement, since 2013 known as Christians on the Left. Other earlier figures are also viewed as Christian socialists, such as the nineteenth century writers Frederick Denison Maurice (The Kingdom of Christ, 1838), John Ruskin (Unto This Last, 1862), Charles Kingsley (The Water-Babies, 1863), Thomas Hughes (Tom Brown's Schooldays, 1857), Frederick James Furnivall (co-creator of the Oxford English Dictionary), Adin Ballou (Practical Christian Socialism, 1854), and Francis Bellamy (a Baptist minister and the author of the United States' Pledge of Allegiance)." (DBpedia, 2017)
in scheme: political affiliation

Christianity
in dataset: The CWRC Ontology
type: religion
type: Concept
comment: La description de ce terme est basée sur celle de DBPedia. @fr
comment: The description for this term is indebted to the Getty Art & Architecture Thesaurus.
label: Christelijk @nl
label: Christendom @nl
label: Christianisme @fr
label: Cristianismo @es
label: chi tu chiao @zh-latn
label: ji du jiao @zh-latn
label: jī dū jiāo @zh-latn
label: 基督教 @zh-hant
broader transitive: Abrahamic religions
definition: "Le christianisme est une religion abrahamique fondée sur l'enseignement, la personne et la vie de Jésus de Nazareth tels qu'ils sont interprétés par la tradition chrétienne à partir du Nouveau Testament de la Bible. Il s'agit d'une religion du salut considérant Jésus-Christ comme le Messie annoncé par les prophètes dans l'Ancien Testament qui vient sauver l'humanité du Mal et la faire participer à la vie de Dieu. La foi en la résurrection de Jésus est au cœur du christianisme car elle signifie le début d'une humanité nouvelle libérée du Mal. Les premières communautés chrétiennes naissent au Ier siècle en Judée et dans les grandes villes de la diaspora juive telles que Rome, Éphèse, Antioche et Alexandrie. Le christianisme se développe dès le IIe siècle dans l'Empire romain, dont il devient la religion officielle au IVe siècle, mais aussi en Perse, en Inde et en Éthiopie. Au Moyen-Âge, le christianisme devint majoritaire en Europe, tandis qu'il s'amenuise face à l'islam dans les régions où il est né. Depuis le XVIe siècle, il est devenu la religion la plus importante de la planète par son expansion en Amérique et, plus tard, en Afrique. Il est actuellement présent dans tous les pays du monde. Les Églises chrétiennes sont classiquement regroupées en trois principales branches : le catholicisme, le christianisme orthodoxe et le protestantisme représentant respectivement 50%, 12% et 37% du total des chrétiens en 2010. À la mi-2015, le nombre total de chrétiens dans le monde est évalué à 2,419 milliards, ce qui en fait la religion comptant le plus grand nombre de fidèles au monde devant l'islam qui en compte environ 1,6 milliard." (DBpedia, 2017) @fr
definition: "Refers to the world religion and culture that developed in the first century CE, driven by the teachings of Jesus Christ of Nazareth. Its roots are in the Judaic tradition and the Old Testament. The tenets include a belief in the death and redemptive resurrection of Jesus. The religion incorporates a tradition of faith, ritual, and a form of church authority or leadership." (Getty, 2017)
definition: "Se refiere a la religión y cultura que se desarrolló en la primera centuria, guiado por la creencia y reverencia por la vida, enseñanza, muerte y resurrección redentiva de Jesucristo de Nazaret. La religión incorpora una tradición de fe, ritual y una forma de iglesia de autoridad y liderazgo." (Getty, 2017) @es
definition: "Verwijst naar de wereldreligie en -cultuur die in de eerste eeuw n. Chr. tot ontwikkeling kwam op basis van de leer van Jezus Christus van Nazareth. De wortels van deze religie liggen in de joodse traditie en het Oude Testament. Een van de kenmerkende grondbeginselen is het geloof in de dood en wederopstanding van Jezus. De religie omvat een traditie van geloof, rituelen en een vorm van kerkelijke autoriteit of leiderschap." (Getty, 2017) @nl
definition: "發展於西元一世紀的世界宗教與文化，跟隨拿薩勒(Nazareth)耶穌基督的教誨。源於猶太傳統及舊約聖經。教義包括相信耶穌之死與救贖復活。此教融合信仰傳統、儀式，及某種形式的教會權威或領導。" (Getty, 2017) @zh-hant
in scheme: religion

Christian Science
is replaced by: Christian Science
in dataset: The CWRC Ontology
type: Concept
comment: Deprecated in favour of instance Christian Science.
comment: Désapprouver en faveur de l'instance Science Chrétienne. @fr
comment: La description de ce terme est basée sur celle de DBPedia. @fr
comment: The description for this term is indebted to the Getty Art & Architecture Thesaurus.
label: Christenwetenschap @nl
label: Ciencia Cristiana @es
label: Science CHRÉTIENNE @fr
deprecated: true
term status: deprecated
broader transitive: Christianity
definition: "La Science chrétienne (ou Christian Science en anglais) se définit elle-même comme la «Science du Christ». Sa fondatrice, la théologienne américaine Mary Baker Eddy, estime avoir redécouvert en 1866 les lois appliquées par Jésus dans la guérison des malades et la résolution des aléas de la vie, lois toujours démontrables aujourd'hui. Son observation des guérisons et résolutions diverses obtenues sur la base de sa théorie en prouve, selon elle, la validité. Ainsi, la Science chrétienne est «chrétienne» en ce sens qu’elle repose sur les enseignements de Jésus de Nazareth, tels qu'exposés dans le Nouveau Testament. La Science chrétienne se veut une religion pratique permettant l'application de lois divines démontrables. Afin d'assurer la diffusion de cette science, Mary Baker Eddy fonde en 1879 une Église sans credo, appelée «Église du Christ, Scientiste» (en anglais The First Church of Christ, Scientist), rassemblant de nos jours 1 800 églises dans 82 pays et quelques centaines de milliers de pratiquants, principalement aux États-Unis. Reconnue comme association cultuelle dans de nombreux pays, notamment aux États-Unis, la Science chrétienne précise que, malgré la confusion possible entre les deux noms, elle n’a rien de commun avec l’Église de Scientologie; de plus, bien qu'elle partage nombre de concepts métaphysiques avec les églises de la Nouvelle Pensée comme Unité, la Science divine et la Science religieuse, ce qui amène certains historiens et sociologues à les aborder ensemble dans leurs travaux, la Science chrétienne et ces églises ne se reconnaissent pas mutuellement comme faisant partie de la même mouvance. La principale critique de la Science chrétienne est qu'elle a un caractère alternatif et non complémentaire au traitement médical. Ainsi, les guérisons alléguées sont obtenues en dehors de tout contrôle médical. Ses guérisons de maladies fonctionnelles ou organiques sont considérées comme relevant de l’effet placebo par les détracteurs de la Science chrét… @fr
definition: "Refers to a Christian denomination and movement founded by Mary Baker Eddy (1821-1910) that seeks to reinstate the Christian message of salvation from all evil, including sickness and disease as well as sin. Eddy, a semi-invalid who was interested in cures not involving medicine, claimed a recovery from a bad injury without medical assistance in 1866. Afterwards, she devoted herself to restoring the healing emphasis of early Christianity. In 1875 she finished writing the first edition of the "Science and Health with Key to the Scriptures." This work and the Bible are the principal texts of the movement and importance has been laid on establishing reading rooms where these works can make their own appeal to readers. The "Christian Science Monitor" is also published by the denomination. Christian Science believes that ignorance is at the root of human unease and thus "dis-ease." Instead of seeking medical treatment, special Christian Science healers are to be consulted for spiritual healing. Health, happiness, and holiness can be restored by applying to all aspects of life practices and attitudes in keeping with the principal of divine harmony. The first Church of Christ, Scientist was founded in 1879 in Boston and its headquarters remain there." (Getty, 2017)
definition: "Se refiere a una secta y movimiento cristiano fundado por Mary Baker Eddy (1821-1910) que busca reincorporar el mensaje cristiano de salvación de todo mal, incluso la enfermedad y padecimiento así como el pecado. Eddy, un semi-inválido que estaba interesado en curas que no involucraran medicina, afirmó que se había recuperado de una lesión grave sin la ayuda médica en 1866. Después, se consagró a restaurar el énfasis curativo de la primera cristiandad. En 1875 ella terminó escribiendo la primera edición del "la Ciencia y Salud con Llave a las Escrituras". Este trabajo y la Biblia son los textos principales del movimiento y importancia se ha puesto en establecer salas de lectura donde estos trabajos pueden hacer su propia apelación a los lectores. El "Instructivo de ciencia cristiano" también fue publicado por la secta. La Ciencia Cristiana cree que la ignorancia es la raíz de los padecimientos humanos y por lo tanto de la enfermedad. En lugar de buscar tratamiento médico, los sanadores de la Ciencia Cristiana especiales serán consultados para la curación espiritual. La salud, felicidad, y santidad pueden ser restauradas aplicando a todos los aspectos de la vida prácticas y actitudes en concordancia con la armonía divina. La primera Iglesia Científica de Cristo, se fundó en 1879 en Boston y su centro principal permanece allí." (Getty, 2017) @es
definition: "Verwijst naar een christelijke gezindte en beweging die is gesticht door Mary Baker Eddy (1821-1910) en die streeft naar herbevestiging van de christelijke boodschap van verlossing van al het kwaad, met inbegrip van ziekte en zonde. Eddy, die half invalide was en geïnteresseerd in genezing zonder medicijnen, beweerde dat zij in 1866 zonder medische hulp was hersteld van zwaar letsel. Daarna wijdde zij zich aan het herstel van de nadruk op gebedsgenezing die het vroege christendom had gekenmerkt. In 1875 voltooide zij de eerste editie van haar boek 'Science and Health with Key to the Scriptures'. Dit werk en de Bijbel zijn de voornaamste geschriften van de beweging, die veel belang hecht aan de inrichting van leesruimten waar deze boeken een eigen beroep op de lezers kunnen doen. Ook de 'Christian Science Monitor' wordt door het kerkgenootschap uitgegeven. Volgens de leer van Christian Science is onwetendheid de wortel van het menselijk ongemak, de menselijke ziekte. In plaats van medische behandeling te zoeken moet men gebedsgenezers van Christian Science raadplegen voor spirituele genezing. Gezondheid, geluk en heiligheid kunnen worden hersteld door alle aspecten van de levenspraktijk en -houding aan te spreken in overeenstemming met het beginsel van goddelijke harmonie. De eerste Church of Christ, Scientist werd in 1879 in Boston gesticht en het hoofdkwartier van de beweging is daar nog altijd gevestigd." (Getty, 2017) @nl
in scheme: religion

Church of England
is replaced by: Anglicanism
in dataset: The CWRC Ontology
type: Concept
type: Organization
comment: Deprecated in favour of instance Anglicanism.
comment: Désapprouver en faveur de l'instance Église d'Angleterre. @fr
deprecated: true
term status: deprecated
broader transitive: Christianity
in scheme: religion

Church of Ireland
in dataset: The CWRC Ontology
type: religion
type: Concept
type: Organization
comment: La description de ce terme est basée sur celle de DBPedia. @fr
comment: The description for this term is indebted to DBpedia.
label: Église d'Irlande @fr
broader transitive: Anglicanism
definition: "L'Église d'Irlande (irlandais : Eaglais na hÉireann, anglais : Church of Ireland) est une communauté religieuse autonome de la communion anglicane, dont le rayon d'action touche la République d'Irlande et l'Irlande du Nord. Comme d'autres Églises anglicanes, elle s'affirme «catholique» et «réformée». Quand l'Église d'Angleterre rompt avec le Pape et l'Église catholique romaine, l'Église d'Irlande évolue également vers la Réforme, gardant son statut juridique et ses possessions, si sa doctrine change. Ainsi, de nos jours, l'Église, dans ses cathédrales et ses églises, conserve largement l'héritage des constructions médiévales de l'île. La nouvelle Église indépendante n'est cependant pas suivie par la majorité de la population ; l'Église catholique romaine conserve le soutien de la plus grande partie des habitants, et ce jusqu'à aujourd'hui. En dépit de son caractère minoritaire, cependant, l'Église d'Irlande conserve le statut de religion d'État jusqu'au désétablissement de 1869, quand Gladstone abolit l'Acte d'établissement. Le nombre d'églises est tombé brusquement au cours du XXe siècle, particulièrement en République d'Irlande, après l'indépendance ; le dernier recensement de la République montre un exemple rare de résistance à la crise de la foi. Aujourd'hui, l'Église d'Irlande est, après l'Église catholique, la deuxième plus importante Église de l'île d'Irlande. C'est également la plus importante Église protestante de la République d'Irlande et le deuxième plus importante d'Irlande du Nord, après l'Église presbytérienne d'Irlande. Elle est gouvernée par un synode général du clergé et des laïcs et organisée en douze diocèses. Elle a à sa tête l'archevêque d'Armagh, qui porte le titre de «Primat de toute l'Irlande». L'archevêque actuel est Richard Clarke qui a succédé le à Alan Harper ; l'autre archevêque est celui de Dublin John Neill." (DBpedia, 2017) @fr
definition: "The Church of Ireland (Irish: Eaglais na hÉireann Scots: Kirk o Airlann) is a Christian church in Ireland and an autonomous province of the Anglican Communion. It is organised on an all-Ireland basis and is the second-largest Christian church on the island after the Catholic Church. Like other Anglican churches, it has retained elements of pre-Reformation practice, notably its episcopal polity, while rejecting the primacy of the Bishop of Rome. Nevertheless, in theological and liturgical matters, it incorporates many principles of the Reformation, particularly those espoused during the English Reformation. The church self identifies as being both Catholic and Reformed. Within the church, differences exist between those members who are more Catholic-leaning (high church) and those who are more Protestant-leaning (low church or evangelical). For historical and cultural reasons, the Church of Ireland is generally identified as a Protestant church. The Church of Ireland is the second-largest in the Republic of Ireland, with around 130,000 members, and the third-largest in Northern Ireland, with around 260,000 members." (DBpedia, 2017)
in scheme: religion

cisgender
in dataset: The CWRC Ontology
type: gender
type: Concept
label: cisgenre @fr
definition: Indicates alignment between a person's gender identity and their sex as understood or assigned at birth. As per the Trans Student Educational Resources (TSER), "the term is not indicative of gender expression, sexual orientation, hormonal makeup, physical anatomy, or how one is perceived in daily life" (TSER, 2017).
definition: Indique l’alignement entre le genre et le sexe d’une personne, tel que celui-ci a été compris ou assigné à sa naissance. Selon le Trans Student Educational Resources (TSER), «le terme n’est pas révélateur de l’expression du genre, de l’orientation sexuelle, de la constitution hormonale, de l’anatomie, ou de la façon dont une personne est perçue au quotidien» (TSER, 2017). @fr
in scheme: gender

cisman
in dataset: The CWRC Ontology
type: gender
type: Thing
type: Concept
label: homme cisgenre @fr
broader: manlabel
definition: Indicates a cisgendered man.
definition: Indique un homme cisgenre. @fr
in scheme: gender

ciswoman
in dataset: The CWRC Ontology
type: gender
type: Thing
type: Concept
label: femme cisgenre @fr
broader: womanlabel
definition: Indicates a cisgendered woman.
definition: Indique une femme cisgenre. @fr
in scheme: gender

civil libertarian
in dataset: The CWRC Ontology
type: political affiliation
type: Concept
comment: The description for this term is indebted to DBpedia.
label: civil libertarianism
label: mouvement libertaire @fr
broader transitive: libertarian
definition: "Civil libertarianism is a strain of political thought that supports civil liberties, or which emphasises the supremacy of individual rights and personal freedoms over and against any kind of authority (such as a state, a corporation, social norms imposed through peer pressure, etc.). Civil libertarianism is not a complete ideology; rather, it is a collection of views on the specific issues of civil liberties and civil rights." (DBpedia, 2017)
in scheme: political affiliation

civil rights
in dataset: The CWRC Ontology
type: political affiliation
type: Concept
value: civil rights activist
value: personal rights advocate
value: pro civil rights
comment: La description de ce terme est basée sur celle de DBPedia. @fr
comment: The description for this term is indebted to DBpedia.
label: Droits civiques @fr
label: civil rights movement
definition: "Civil and political rights are a class of rights that protect individuals' freedom from infringement by governments, social organisations, and private individuals. They ensure one's ability to participate in the civil and political life of the society and state without discrimination or repression. Civil rights include the ensuring of people's physical and mental integrity, life, and safety; protection from discrimination on grounds such as race, gender, national origin, colour, age, political affiliation, ethnicity, religion, or disability; and individual rights such as privacy and the freedoms of thought, speech, religion, press, assembly, and movement. Political rights include natural justice (procedural fairness) in law, such as the rights of the accused, including the right to a fair trial; the right to due process; the right to seek redress or a legal remedy; and rights of participation in civil society and politics such as freedom of association, the right to assemble, the right to petition, the right of self-defense, and the right to vote. Civil and political rights form the original and main part of international human rights. They comprise the first portion of the 1948 Universal Declaration of Human Rights (with economic, social, and cultural rights comprising the second portion). The theory of three generations of human rights considers this group of rights to be "first-generation rights", and the theory of negative and positive rights considers them to be generally negative rights." (DBpedia, 2017)
definition: "Les droits civiques désignent les protections et privilèges des libertés fondamentales accordés à tous les citoyens par la loi contre toutes les discriminations." (DBpedia, 2017) @fr
in scheme: political affiliation

co-operative movement
in dataset: The CWRC Ontology
type: political affiliation
type: Concept
comment: The description for this term is indebted to DBpedia.
label: mouvement pour l'économie sociale @fr
definition: Défense de l'économie sociale, voir Histoire de l'économie sociale — Wikipédia @fr
definition: Supporter of the co-operative movement. History of the cooperative movement - Wikipedia
in scheme: political affiliation
related: progressivism

communalist
in dataset: The CWRC Ontology
type: political affiliation
type: Concept
comment: The description for this term is indebted to DBpedia.
label: communalism
label: municipalisme libertaire @fr
definition: "Communalism usually refers to a system that integrates communal ownership and federations of highly localised independent communities. A prominent libertarian socialist, Murray Bookchin, defines communalism as "a theory of government or a system of government in which independent communes participate in a federation", as well as "the principles and practice of communal ownership". This usage of communalism appears to have emerged during the late 20th century to distinguish commune-based systems from other political movements and/or governments espousing (if not actually practicing) similar ideas. In particular, earlier communities and movements advocating such practices that were often described as "anarchist", "socialist" and/or "communist". Many historical communities practicing utopian socialism or anarchist communism did implement internal rules of communalist property ownership in the context of federated communalism. It is at least theoretically possible for a federation of communes to include communes which do not practice communalist rules of property, which is to say, that the overall national government may be a federation of communes, but that private property rather than communalist property is the order within each such commune. Karl Marx, often viewed as the founder of modern communism, criticized older forms, including primitive communism and/or utopian socialism, as poorly conceived and/or prone to disintegration in practise. Communalism in the form described above is distinct from the predominant usage in South Asian forms of English: allegiance to a particular ethnic and/or religious group rather than to a broader society. As such, this usage is synonymous with sectarianism and associated with communal violence." (DBpedia, 2017)
in scheme: political affiliation

christian communist
in dataset: The CWRC Ontology
contrary to: anti-communist
contrary to: liberal
type: political affiliation
type: Concept
value: communist
comment: La description de ce terme est basée sur celle de DBPedia. @fr
comment: The description for this term is indebted to DBpedia.
label: Communisme @fr
label: communism
definition: "In political and social sciences, communism (from Latin communis, "common, universal") is a social, political, and economic ideology and movement whose ultimate goal is the establishment of the communist society, which is a socioeconomic order structured upon the common ownership of the means of production and the absence of social classes, money, and the state. Communism includes a variety of schools of thought, which broadly include Marxism, anarchism (anarchist communism), and the political ideologies grouped around both. All these hold in common the analysis that the current order of society stems from its economic system, capitalism, that in this system, there are two major social classes: the working class – who must work to survive, and who make up a majority of society – and the capitalist class – a minority who derive profit from employing the proletariat, through private ownership of the means of production (the physical and institutional means with which commodities are produced and distributed), and that political, social and economic conflict between these two classes will trigger a fundamental change in the economic system, and by extension a wide-ranging transformation of society. The primary element which will enable this transformation, according to this analysis, is the social ownership of the means of production." (DBpedia, 2017)
definition: "Le communisme (du latin communis – commun, universel) est un ensemble de doctrines politiques issues du socialisme et, pour la plupart, du marxisme, opposées au capitalisme et visant à l'instauration d'une société sans classes sociales. Plus largement, ce terme est associé au mouvement communiste international né après la Première Guerre mondiale, fruit d'une scission de la IIe Internationale provoquée par les bolcheviks. Il renvoie également, dans le contexte de la guerre froide, à une alliance géopolitique (bloc communiste) dominée par l'Union soviétique, ainsi qu'au régime politique à parti unique, dictatorial ou totalitaire, en vigueur dans les pays du bloc communiste. Dans son sens d'origine, le communisme est une forme d'organisation sociale sans classes, sans État et sans monnaie, où les biens matériels seraient partagés. Au XIXe siècle, le mot «communisme» entre dans le vocabulaire du socialisme. Il se rattache en particulier à l'œuvre de Karl Marx et Friedrich Engels - qui le reprennent à leur compte en 1848 dans le Manifeste du Parti communiste - et, par extension, à l'école de pensée marxiste. En 1917, les bolcheviks, dirigés par Lénine, prennent le pouvoir en Russie lors de la Révolution d'Octobre. Cet évènement change radicalement le sens du mot communisme : il désigne désormais un mouvement politique international, né d'une scission du socialisme, et qui se reconnaît dans le courant révolutionnaire incarné par les bolcheviks comme dans l'interprétation du marxisme par Lénine. Le communisme se présente désormais comme la véritable expression politique du mouvement ouvrier, au détriment de la social-démocratie dont il est issu. Selon cette acception, le communisme constitue l'un des phénomènes les plus importants du XXe siècle, qui a pu être qualifié de «siècle du communisme» tant cette idéologie y a tenu un rôle moteur. Lénine et ses partisans créent en 1919 l'Internationale communiste (dite Troisième Internationale, ou Komintern) afin de regrouper à l… @fr
in scheme: political affiliation
related: chinese communism
related: marxist

Congregational Church
is replaced by: congragationalism
in dataset: The CWRC Ontology
type: Concept
comment: Deprecated in favour of instance .
comment: Désapprouver en faveur de l'instance . @fr
comment: La description de ce terme est basée sur celle de DBPedia. @fr
label: Églises congrégationalistes @fr
deprecated: true
term status: deprecated
broader transitive: Christianity
definition: "Congregational churches are Protestant Christian churches practicing congregationalist church governance, in which each congregation independently and autonomously runs its own affairs. Congregationalism is often considered to be a part of the wider Reformed tradition. Many Congregational churches claim their descent from Protestant denominations formed on a theory of union published by the theologian Robert Browne in 1582. These arose from the ideas of nonconforming Protestants during the Puritan Reformation of the Church of England. In Great Britain, the early Congregationalists were called Separatists or Independents to distinguish them from the similarly Calvinistic Presbyterians. Congregational churches were widely established in the Plymouth Colony and the Massachusetts Bay Colony (later New England), and together wrote the Cambridge Platform of 1648 which described the autonomy of the church and its association with others. Within the United States, the model of Congregational churches was carried by migrating settlers from New England into New York, then into the Old North West, and further. With their insistence on independent local bodies, they became important in many social reform movements, including abolitionism, temperance, and women's suffrage. Modern Congregationalism in the United States is largely split into three bodies: the United Church of Christ, the National Association of Congregational Christian Churches and the Conservative Congregational Christian Conference, which is the most theologically conservative. Congregationalism, as defined by the Pew Research Center, is estimated to represent 0.5% of the worldwide Protestant population." (DBpedia, 2017)
definition: "Les Églises congrégationalistes sont des églises protestantes de tradition réformée, pratiquant une forme d’organisation d’église où chaque paroisse se gère de manière entièrement autonome et indépendante. Le congrégationalisme se caractérise plus comme un mouvement que comme une dénomination chrétienne en raison de sa conviction fondamentale en faveur de l’autonomie complète de chaque paroisse. Malgré la forte diversité théologique inhérente à leur forme d'organisation, la plupart des congrégationalistes se considèrent d'abord comme des réformés, soit traditionnels soit néo-orthodoxes (barthiens). Les congrégationalistes, selon la définition du centre de recherche indépendant Pew Research Center, représentent environ 0,5% de la population protestante mondiale, soit 4 millions de chrétiens répartis essentiellement dans les grands pays anglophones (Royaume-Uni, États-Unis, Canada, Australie, Afrique du sud, Irlande) et dans quelques «terres de mission» (Argentine, Bulgarie, Îles Samoa). Leur rôle historique et leur influence, notamment aux États-Unis, excèdent largement ces chiffres." (DBpedia, 2017) @fr
in scheme: religion

Congregationalism
in dataset: The CWRC Ontology
type: religion
type: Concept
comment: La description de ce terme est basée sur celle de DBPedia. @fr
comment: The description for this term is indebted to DBpedia.
label: Églises congrégationalistes @fr
broader transitive: Dissent (Protestant)
definition: "Congregational churches are Protestant Christian churches practicing congregationalist church governance, in which each congregation independently and autonomously runs its own affairs. Congregationalism is often considered to be a part of the wider Reformed tradition. Many Congregational churches claim their descent from Protestant denominations formed on a theory of union published by the theologian Robert Browne in 1582. These arose from the ideas of nonconforming Protestants during the Puritan Reformation of the Church of England. In Great Britain, the early Congregationalists were called Separatists or Independents to distinguish them from the similarly Calvinistic Presbyterians. Congregational churches were widely established in the Plymouth Colony and the Massachusetts Bay Colony (later New England), and together wrote the Cambridge Platform of 1648 which described the autonomy of the church and its association with others. Within the United States, the model of Congregational churches was carried by migrating settlers from New England into New York, then into the Old North West, and further. With their insistence on independent local bodies, they became important in many social reform movements, including abolitionism, temperance, and women's suffrage. Modern Congregationalism in the United States is largely split into three bodies: the United Church of Christ, the National Association of Congregational Christian Churches and the Conservative Congregational Christian Conference, which is the most theologically conservative. Congregationalism, as defined by the Pew Research Center, is estimated to represent 0.5% of the worldwide Protestant population." (DBpedia, 2017)
definition: "Les Églises congrégationalistes sont des églises protestantes de tradition réformée, pratiquant une forme d’organisation d’église où chaque paroisse se gère de manière entièrement autonome et indépendante. Le congrégationalisme se caractérise plus comme un mouvement que comme une dénomination chrétienne en raison de sa conviction fondamentale en faveur de l’autonomie complète de chaque paroisse. Malgré la forte diversité théologique inhérente à leur forme d'organisation, la plupart des congrégationalistes se considèrent d'abord comme des réformés, soit traditionnels soit néo-orthodoxes (barthiens). Les congrégationalistes, selon la définition du centre de recherche indépendant Pew Research Center, représentent environ 0,5% de la population protestante mondiale, soit 4 millions de chrétiens répartis essentiellement dans les grands pays anglophones (Royaume-Uni, États-Unis, Canada, Australie, Afrique du sud, Irlande) et dans quelques «terres de mission» (Argentine, Bulgarie, Îles Samoa). Leur rôle historique et leur influence, notamment aux États-Unis, excèdent largement ces chiffres." (DBpedia, 2017) @fr
in scheme: religion

conscientious objection
in dataset: The CWRC Ontology
type: political affiliation
type: Concept
comment: The description for this term is indebted to DBpedia.
label: objection de conscience @fr
broader transitive: pacifist
definition: "A conscientious objector is an "individual who has claimed the right to refuse to perform military service" on the grounds of freedom of thought, conscience, disability, or religion. In general, conscientious objector status is considered only in the context of military conscription and is not applicable to volunteer military forces. In some countries, conscientious objectors are assigned to an alternative civilian service as a substitute for conscription or military service. Some conscientious objectors consider themselves pacifist, non-interventionist, non-resistant, non-aggressionist, or antimilitarist. On March 8, 1995 the United Nations Commission on Human Rights resolution 1995/83 stated that "persons performing military service should not be excluded from the right to have conscientious objections to military service." This was re-affirmed in 1998, when resolution 1998/77 recognized that "persons [already] performing military service may develop conscientious objections." A number of organisations around the world celebrate the principle on May 15 as International Conscientious Objectors Day. The term has also been extended to objecting to working for the military-industrial complex due to a crisis of conscience." (DBpedia, 2017)
in scheme: political affiliation

conservative
in dataset: The CWRC Ontology
type: political affiliation
type: Concept
comment: La description de ce terme est basée sur celle de DBPedia. @fr
comment: The description for this term is indebted to DBpedia.
label: Conservatisme @fr
label: conservatism
definition: "Conservatism as a political and social philosophy promotes retaining traditional social institutions in the context of culture and civilization. Some conservatives seek to preserve things as they are, emphasising stability and continuity, while others, called reactionaries, oppose modernism and seek a return to "the way things were". The first established use of the term in a political context originated with François-René de Chateaubriand in 1818, during the period of Bourbon restoration that sought to roll back the policies of the French Revolution. The term, historically associated with right-wing politics, has since been used to describe a wide range of views. There is no single set of policies that are universally regarded as conservative, because the meaning of conservatism depends on what is considered traditional in a given place and time. Thus conservatives from different parts of the world—each upholding their respective traditions—may disagree on a wide range of issues. Edmund Burke, an 18th-century politician who opposed the French Revolution but supported the American Revolution, is credited as one of the main theorists of conservatism in Britain in the 1790s. According to Quintin Hogg, the chairman of the British Conservative Party in 1959, "Conservatism is not so much a philosophy as an attitude, a constant force, performing a timeless function in the development of a free society, and corresponding to a deep and permanent requirement of human nature itself."" (DBpedia, 2017)
definition: "Le conservatisme est une philosophie politique qui est en faveur des valeurs traditionnelles et qui s'oppose au progressisme. Les cultures ayant chacune des valeurs différentes, les conservateurs selon leur culture ont des buts différents. Mais tous les conservateurs promeuvent la défense (statu quo) ou le retour à des valeurs établies (statu quo ante). Pour Michael Freeden, le conservatisme croit seulement en un changement limité de ce qui est naturel ou organique ; aussi, pour lui, l'ordre social est indépendant de la volonté humaine. Le terme vient de «conserver» ; du latin conservare, «maintenir, observer (une loi, une coutume)» composé de servare «préserver, garder». Bien que ce ne soit pas une idéologie en soi, le conservatisme est une philosophie politique dont les idées sont en grande partie liées à leur contexte d'existence. Il est défini en partie par l'accent mis sur la tradition comme source de sagesse, bien au-delà de ce qui peut être démontré ou explicitement établi. Il se fonde sur la conservation d'un ordre préétabli, selon les conventions, chacun à sa place." (DBpedia, 2017) @fr
in scheme: political affiliation
related: neo-conservatism

conservative feminism
in dataset: The CWRC Ontology
type: political affiliation
type: Concept
comment: The description for this term is indebted to DBpedia.
label: féminisme conservateur @fr
broader transitive: activist for women and children
definition: Feminism that tends towards social conservativism. See Feminism - Wikipedia
definition: Féminisme qui tend vers le conservatisme social. Voir Féminisme — Wikipédia @fr
in scheme: political affiliation
related: conservative

conservative party
in dataset: The CWRC Ontology
type: political affiliation
type: Concept
comment: The description for this term is indebted to DBpedia.
label: Conservative Party (UK)
label: Parti Conservateur (Royaume-Uni) @fr
broader transitive: conservative
definition: "The Tories were members of two political parties which existed, sequentially, in the Kingdom of England, the Kingdom of Great Britain, and later the United Kingdom of Great Britain and Ireland from the 17th to the early 19th centuries. The first Tories emerged in 1678 in England, when they opposed the Whig-supported Exclusion Bill which set out to disinherit the heir presumptive James, Duke of York (who eventually became James II of England and VII of Scotland). This party ceased to exist as an organised political entity in the early 1760s, although it was used as a term of self-description by some political writers. A few decades later, a new Tory party would rise to establish a hold on government between 1783 and 1830, with William Pitt the Younger followed by Robert Jenkinson, 2nd Earl of Liverpool. The Earl of Liverpool was succeeded by fellow Tory Arthur Wellesley, 1st Duke of Wellington, whose term included the Catholic Emancipation, which occurred mostly due to the election of Daniel O'Connell as a Catholic MP from Ireland. When the Whigs subsequently regained control, the Representation of the People Act 1832 removed the rotten boroughs, many of which were controlled by Tories. In the following general election, the Tory ranks were reduced to 180 MPs. Under the leadership of Robert Peel, the Tamworth Manifesto was issued, which began to transform the Tories into the Conservative Party. However, Peel lost many of his supporters by repealing the Corn Laws, causing the party to break apart. One faction, led by the Earl of Derby and Benjamin Disraeli, survived to become the modern Conservative Party, whose members are commonly still referred to as Tories." (DBpedia, 2017)
in scheme: political affiliation
related: toryPartyUk

constitutional feminist
in dataset: The CWRC Ontology
type: political affiliation
type: Concept
value: constitutionalist
comment: La description de ce terme est basée sur celle de DBPedia. @fr
comment: The description for this term is indebted to DBpedia.
label: Constitutionnalisme @fr
label: constitutionalism
definition: "Constitutionalism is "a complex of ideas, attitudes, and patterns of behavior elaborating the principle that the authority of government derives from and is limited by a body of fundamental law". Political organisations are constitutional to the extent that they "contain institutionalized mechanisms of power control for the protection of the interests and liberties of the citizenry, including those that may be in the minority". As described by political scientist and constitutional scholar David Fellman: Constitutionalism is descriptive of a complicated concept, deeply embedded in historical experience, which subjects the officials who exercise governmental powers to the limitations of a higher law. Constitutionalism proclaims the desirability of the rule of law as opposed to rule by the arbitrary judgment or mere fiat of public officials…. Throughout the literature dealing with modern public law and the foundations of statecraft the central element of the concept of constitutionalism is that in political society government officials are not free to do anything they please in any manner they choose; they are bound to observe both the limitations on power and the procedures which are set out in the supreme, constitutional law of the community. It may therefore be said that the touchstone of constitutionalism is the concept of limited government under a higher law." (DBpedia, 2017)
definition: "Le constitutionnalisme est une théorie du droit qui insiste sur le rôle et la fonction de la Constitution dans la hiérarchie des normes par rapport à la loi, ainsi que sur le contrôle de constitutionnalité des lois. On l'oppose parfois au légicentrisme, qui défend la suprématie de la loi, émanation de la souveraineté populaire. En droit international, le constitutionnalisme est une conception qui tend à s'opposer au pluralisme juridique." (DBpedia, 2017) @fr
in scheme: political affiliation

contrary to
in dataset: The CWRC Ontology
type: ObjectProperty
type: SymmetricProperty
label: contraire à @fr

COUSIN
in dataset: The CWRC Ontology
type: ObjectProperty
label: cousin de @fr
label: cousin of
sub property of: FAMILY

Covenanters
in dataset: The CWRC Ontology
type: political affiliation
type: Concept
comment: La description de ce terme est basée sur celle de DBPedia. @fr
comment: The description for this term is indebted to DBpedia.
label: Covenantaire @fr
definition: "Les Covenantaires formèrent un important mouvement religieux et politique en Écosse au XVIIe siècle. Du point de vue religieux, ce mouvement s'attacha surtout à promouvoir et à développer le presbytérianisme, et à en faire une forme de gouvernement souhaitée par le peuple, en opposition avec l'Épiscopalisme, qui avait les faveurs de la couronne. Du point de vue politique, ce mouvement vit d'importantes évolutions du caractère et du fonctionnement du Parlement écossais, qui commença à se démarquer progressivement de ses origines médiévales. Dans son ensemble, ce mouvement était essentiellement conservateur dans le ton, mais il amorça une révolution qui embrasa l'Écosse, l'Angleterre et l'Irlande, et qui fut appelée les guerres des Trois Royaumes. Le nom Covenantaire provient de «covenant», qui est un mot de l'ancien français, passé dans le moyen anglais, qui signifiait à l'origine convention, chose convenue, et qui désigna, dans la loi anglaise, un accord formel, une promesse solennelle. En Écosse, le terme prit le sens biblique d'«Alliance» ou de «Promesse». Le premier engagement de ce genre fut signé par les Écossais de toutes les classes, en 1588, lorsque Philippe II menaçait l'Angleterre et la Réforme par sa fameuse Invincible Armada. Il contenait une profession de foi protestante, une réprobation de l'Église romaine et un serment de défense mutuelle et d'union. La destruction de la flotte espagnole rendit cette confédération sans objet. Au siècle suivant, le «National Covenant» de 1638, qui prit comme base des documents précédents du même genre, était surtout intéressé à préserver la Réforme de toute innovation issue de la couronne britannique. Son document jumeau de 1643, «Solemn League and Covenant», se préoccupait également de religion, même s'il s'agissait principalement d'un traité d'alliance entre les covenantaires d'Écosse et le Parlement d'Angleterre, soucieux de se soutenir lors de la guerre civile de plus en plus violente contre le roi Charles Ier." (… @fr
definition: "The Covenanters were a Scottish Presbyterian movement that played an important part in the history of Scotland, and to a lesser extent that of England and Ireland, during the 17th century. Presbyterian denominations tracing their history to the Covenanters and often incorporating the name continue the ideas and traditions in Scotland and internationally. They derive their name from the term covenant after the Covenant between God and the Israelites in the Old Testament. There were two important covenants in Scottish history, the National Covenant and the Solemn League and Covenant." (DBpedia, 2017)
in scheme: political affiliation

cultural form to
in dataset: The CWRC Ontology
type: ObjectProperty
inverse of: has a cultural form
definition: This is the inverse of has a cultural form.

The Canadian Writing Research Collaboratory
type: Organization
name: Le Collaboratoire scientifique des écrits du Canada @fr

The CWRC Ontology
jurisdiction: Canada
attribution URL: http://www.cwrc.ca/
license: http://creativecommons.org/licenses/by-nc/4.0/
ctb: Constance Crompton
ctb: Members of the Orlando Project
fnd: Social Sciences and Humanities Research Council
pdr: Susan Brown
creator: AbiLemak
creator: Alliyya Mo
creator: Colin Faulkner
creator: Deborah Stacey
creator: Jade Penancier
creator: Joel Cummings
creator: John Simpson
creator: Kim Martin
creator: Robert Warren
creator: Susan Brown
description: L'Ontologie CWRC est l'ontologie du Collaboratoire scientifique des écrits du Canada. @fr
description: The CWRC Ontology is the ontology of the Canadian Writing Research Collaboratory.
publisher: The Canadian Writing Research Collaboratory
subject: sh2009007122
subject: sh85013838
subject: sh85019388
subject: sh85043777
subject: sh85077519
title: L'Ontologie CWRC @fr
entities: 515
triples: 5936
type: Dataset

DAUGHTER
in dataset: The CWRC Ontology
type: ObjectProperty
label: daughter of
label: fille de @fr
sub property of: CHILD

anti-anglican
in dataset: The CWRC Ontology
type: political affiliation
type: Concept
value: anti-episcopal
value: anti-episcopalian
value: anti-tithes
comment: The description for this term is indebted to DBpedia.
label: disestablishmentarianism
label: sécularisme anglais @fr
definition: "Disestablishmentarianism refers to campaigns to sever links between church and state, particularly in relation to the Church of England as an established church. It was initially a movement in the United Kingdom in the 18th century. The established churches in Wales and Ireland could not count on even nominal adherence by a majority of the population of those countries. In Ireland, the predominantly Roman Catholic population campaigned against the position of the established Anglican Church of Ireland - eventually disestablished in Ireland from 1 January 1871. In England there was a campaign by Liberals, dissenters and nonconformists to disestablish the Church of England in the 19th century. The campaigners were called "Liberationists" (the "Liberation Society" was founded by Edward Miall in 1844). This campaign failed, but nearly all of the legal disabilities of nonconformists were gradually dismantled. The campaign for disestablishment was revived in the 20th century when Parliament rejected the 1929 revision of the Book of Common Prayer, leading to calls for separation of Church and State to prevent political interference in matters of worship. In the late 20th century, reform of the House of Lords also brought into question the position of the Lords Spiritual. Nick Clegg, the former Deputy Prime Minister of the United Kingdom and Leader of the Liberal Democrats, said in April 2014 that he thought the Church of England and the British state should be separated "in the long run". Prime Minister David Cameron, responding to Clegg's comments, said that disestablishmentarianism is "a long-term Liberal idea, but it is not a Conservative one" and that he believed having an established church works well. The Church of England was disestablished in Wales in 1920, becoming the Church in Wales. An Act of the British Parliament enabling the disestablishment of the Church of Ireland was passed in 1869, coming into effect on 1 January 1871. The Church of Scotland was disesta…
in scheme: political affiliation

Dissent (Protestant)
in dataset: The CWRC Ontology
type: religion
type: Concept
label: dissidents (ou non-conformistes) @fr
broader transitive: Protestantism
definition: "English Dissenters were Christians who separated from the Church of England in the 16th, 17th and 18th centuries. A dissenter (from the Latin dissentire, "to disagree") is one who disagrees in matters of opinion, belief, etc. English Dissenters opposed state interference in religious matters, and founded their own churches, educational establishments, and communities; some emigrated to the New World. They originally agitated for a wide-reaching Protestant Reformation of the Established Church, and triumphed briefly under Oliver Cromwell".(DBpedia, 2017) See also: Nonconformist - Wikipedia
definition: "In English church history, a nonconformist was a Protestant who did not "conform" to the governance and usages of the established Church of England. Broad use of the term was precipitated after the Restoration of the British monarchy in 1660, when the Act of Uniformity 1662 re-established the opponents of reform within the Church of England. By the late 19th-century the term specifically included the Reformed Christians (Presbyterians, Congregationalists and other Calvinist sects), plus the Baptists and Methodists. The English Dissenters such as the Puritans who violated the Act of Uniformity 1559 — typically by practising radical, sometimes separatist, dissent — were retrospectively labelled as nonconformists".(DBpedia, 2017) Dissenting Protestantism and nonconformism are historical phenomena that become less relevant in the United Kingdom from the early twentieth century onwards, and many groups such as Baptists and Presbyterians have significant followings in other parts of the world.
definition: "Les Dissidents anglais (en anglais : English Dissenters ou nonconformists) sont des protestants anglais qui firent sécession de l'Église d'Angleterre. Ils s'opposaient à l'interférence de l'État dans les affaires religieuses et fondèrent leurs propres communautés du XVIe au XVIIIe siècle. Les Dissidents triomphèrent un temps lors du gouvernement d'Oliver Cromwell, mais après la Restauration de la monarchie, en 1660, l'épiscopat fut rétabli et les droits civiques des Dissidents limités, dès les années 1660, par une série de lois dont l’Act of Uniformity, le Corporation Act et le Test Act. Ce n'est qu'en 1828 que ces lois discriminatoires sont abrogées. Parmi les Dissidents les plus connus, on peut citer le fondateur de la secte des Puritains Henry Jacob (en) (1563-1624), l'éditeur Joseph Johnson (1738-1809), la mystique Jane Leade (1623-1704), le philosophe Richard Price (1723-1791), ou encore le chimiste et théologien Joseph Priestley (1733-1804), ainsi que le fondateur d'une académie dissidente à Kendal (Cumbria), le révérend Caleb Rotherham, qui instruisit l'un des pères de la Révolution industrielle, le fondeur et beau-frère de Joseph Priestley, John Wilkinson".(DBpedia, 2017)Voir aussi: Non-conformistes — Wikipédia @fr
definition: "Les non-conformistes, appelés aussi Dissidents (dissenters), étaient ceux qui, en Angleterre, refusaient de suivre la doctrine de l'Église anglicane. Il s'agissait notamment des Puritains, des Presbytériens, des Anabaptistes ou des Calvinistes. On oppose les non-conformistes aux Conformistes".(DBpedia, 2017) @fr
in scheme: religion

Dissenters
is replaced by: Dissent (Protestant)
in dataset: The CWRC Ontology
type: Concept
comment: Deprecated in favour of instance Dissent (Protestant).
comment: Désapprouver en faveur de l'instance dissidents (ou non-conformistes). @fr
label: dissidents (ou non-conformistes) @fr
deprecated: true
term status: deprecated
broader transitive: Anglicanism
definition: "One who dissents or disagrees in matters of opinion, belief, &c. The term "dissenter" is, however, practically restricted to the special sense of a member of a religious body in England which has, for one reason or another, separated from the Established Church. Strictly, the term includes the English Roman Catholics, who in the original draft of the Relief Act of 1791 were styled "Protesting Catholic Dissenters." It is in practice, however, restricted to the "Protestant Dissenters" referred to in sec. ii. of the Toleration Act of 1688. "(Encyclopedia Britannica, 1911)
in scheme: religion

Dissenting Christianity
is replaced by: Dissent (Protestant)
in dataset: The CWRC Ontology
type: Concept
comment: La description de ce terme est basée sur celle de DBPedia. @fr
comment: The description for this term is indebted to DBpedia.
label: Dissidence anglaise @fr
deprecated: true
term status: deprecated
broader transitive: Protestantism
definition: "English Dissenters were Christians who separated from the Church of England in the 16th, 17th and 18th centuries. A dissenter (from the Latin dissentire, "to disagree") is one who disagrees in matters of opinion, belief, etc. English Dissenters opposed state interference in religious matters, and founded their own churches, educational establishments, and communities; some emigrated to the New World. They originally agitated for a wide-reaching Protestant Reformation of the Established Church, and triumphed briefly under Oliver Cromwell".(DBpedia, 2017) See also: Nonconformist - Wikipedia
definition: "Les Dissidents anglais (en anglais : English Dissenters ou nonconformists) sont des protestants anglais qui firent sécession de l'Église d'Angleterre. Ils s'opposaient à l'interférence de l'État dans les affaires religieuses et fondèrent leurs propres communautés du XVIe au XVIIIe siècle. Les Dissidents triomphèrent un temps lors du gouvernement d'Oliver Cromwell, mais après la Restauration de la monarchie, en 1660, l'épiscopat fut rétabli et les droits civiques des Dissidents limités, dès les années 1660, par une série de lois dont l’Act of Uniformity, le Corporation Act et le Test Act. Ce n'est qu'en 1828 que ces lois discriminatoires sont abrogées. Parmi les Dissidents les plus connus, on peut citer le fondateur de la secte des Puritains Henry Jacob (en) (1563-1624), l'éditeur Joseph Johnson (1738-1809), la mystique Jane Leade (1623-1704), le philosophe Richard Price (1723-1791), ou encore le chimiste et théologien Joseph Priestley (1733-1804), ainsi que le fondateur d'une académie dissidente à Kendal (Cumbria), le révérend Caleb Rotherham, qui instruisit l'un des pères de la Révolution industrielle, le fondeur et beau-frère de Joseph Priestley, John Wilkinson".(DBpedia, 2017)Voir aussi: Non-conformistes — Wikipédia @fr
in scheme: religion

Dissenting Churches
is replaced by: Dissent (Protestant)
in dataset: The CWRC Ontology
type: Concept
comment: Deprecated in favour of instance Dissent (Protestant).
comment: Désapprouver en faveur de l'instance dissidents (ou non-conformistes). @fr
label: Églises dissidentes @fr
deprecated: true
term status: deprecated
broader transitive: Anglicanism
definition: "English Dissenters were Christians who separated from the Church of England in the 16th, 17th, and 18th centuries. A dissenter (from the Latin dissentire, "to disagree") is one who disagrees in matters of opinion, belief, etc. English Dissenters opposed state interference in religious matters, and founded their own churches, educational establishments, and communities; some emigrated to the New World. They originally agitated for a wide-reaching Protestant Reformation of the Established Church, and triumphed briefly under Oliver Cromwell".(DBpedia, 2017)
definition: "Les Dissidents anglais (en anglais : English Dissenters ou nonconformists) sont des protestants anglais qui firent sécession de l'Église d'Angleterre1. Ils s'opposaient à l'interférence de l'État dans les affaires religieuses et fondèrent leurs propres communautés du xvie au xviiie siècle. Les Dissidents triomphèrent un temps lors du gouvernement d'Oliver Cromwell, mais après la Restauration de la monarchie, en 1660, l'épiscopat fut rétabli et les droits civiques des Dissidents limités, dès les années 1660, par une série de lois dont l’Act of Uniformity, le Corporation Act et le Test Act. Ce n'est qu'en 1828 que ces lois discriminatoires sont abrogées".(DBpedia, 2017) @fr
in scheme: religion

dress reformer
in dataset: The CWRC Ontology
type: political affiliation
type: Concept
comment: The description for this term is indebted to DBpedia.
label: dress reform
label: réforme vestimentaire @fr
broader transitive: activist for women and children
definition: "Victorian dress reform was an objective of the Victorian dress reform movement (also known as the rational dress movement) of the middle and late Victorian era, comprising various reformers who proposed, designed, and wore clothing considered more practical and comfortable than the fashions of the time. Dress reformists were largely middle class women involved in the first wave of feminism in the United States and in Britain, from the 1850s through the 1890s. The movement emerged in the Progressive Era along with calls for temperance, women's education, suffrage and moral purity. Dress reform called for emancipation from the "dictates of fashion", expressed a desire to "cover the limbs as well as the torso adequately," and promoted "rational dress". The movement had its greatest success in the reform of women's undergarments, which could be modified without exposing the wearer to social ridicule. Dress reformers were also influential in persuading women to adopt simplified garments for athletic activities such as bicycling or swimming. The movement was much less concerned with men's clothing, although it initiated the widespread adoption of knitted wool union suits or long johns. Some proponents of the movement established dress reform parlors, or storefronts, where women could buy sewing patterns for the newfangled garments, or buy them directly." (DBpedia, 2017)
in scheme: political affiliation

Dreyfusard
in dataset: The CWRC Ontology
contrary to: antisematism
type: political affiliation
type: Concept
comment: The description for this term is indebted to DBpedia.
broader transitive: human rights activist
definition: Défenseurs du capitaine Alfred Dreyfus lors de son procès. Voir Affaire Dreyfus — Wikipédia @fr
definition: Supporters of Captain Alfred Dreyfus in his prosecution by the French military. See: Dreyfus affair - Wikipedia
in scheme: political affiliation
related: anti-anti-semitism

education reformer
in dataset: The CWRC Ontology
type: political affiliation
type: Concept
value: educational reform
value: educational reformer
value: educationalist
value: state education movement
comment: The description for this term is indebted to DBpedia.
label: education reform
label: réforme de l'éducation @fr
broader transitive: progressivism
definition: "Education reform is the name given to the goal of changing public education. Historically, reforms have taken different forms because the motivations of reformers have differed. However, since the 1980s, education reform has been focused on changing the existing system from one focused on inputs to one focused on outputs (i.e., student achievement). In the United States, education reform acknowledges and encourages public education as the primary source of K-12 education for American youth. Education reformers desire to make public education into a market (in the form of an input-output system), where accountability creates high-stakes from curriculum standards tied to standardized tests. As a result of this input-output system, equality has been conceptualized as an end point, which is often evidenced by an achievement gap among diverse populations. This conceptualization of education reform is based on the market-logic of competition. As a consequence, competition creates inequality which has continued to drive the market-logic of equality at an end point by reproducing the achievement gap among diverse youth. Overall, education reform has and continues to be used as a substitute for needed economic reforms in the United States. The one constant for all forms of education reform includes the idea that small changes in education will have large social returns in citizen health, wealth, and well-being. For example, a stated motivation has been to reduce cost to students and society. From ancient times until the 1800s, one goal was to reduce the expense of a classical education. Ideally, classical education is undertaken with a highly educated full-time (extremely expensive) personal tutor. Historically, this was available only to the most wealthy. Encyclopedias, public libraries and grammar schools are examples of innovations intended to lower the cost of a classical education. Related reforms attempted to develop similar classical results by concentrating on "why"…
in scheme: political affiliation
related: civil rights

Educational award Prize
in dataset: The CWRC Ontology
type: Educational award
definition: An educational prize is a medal or award, monetary or otherwise, presented by either an institution or person of authority to an individual who has excelled beyond their peers, reached a great achievement, and/or produced a very high standard of work.
in scheme: Educational award

Educational award Scholarship
in dataset: The CWRC Ontology
type: Educational award
definition: A scholarship is an award of financial aid for a student to further their education. Scholarships are awarded based upon various criteria, which usually reflect the values and purposes of the donor or founder of the award. Scholarship money is not required to be repaid.
in scheme: Educational award

egalitarian
in dataset: The CWRC Ontology
type: political affiliation
type: Concept
comment: La description de ce terme est basée sur celle de DBPedia. @fr
comment: The description for this term is indebted to DBpedia.
label: egalitarianism
label: Égalitarisme @fr
definition: "Egalitarianism (from French égal, meaning "equal")—or equalitarianism—is a trend of thought that favors equality for all people. Egalitarian doctrines maintain that all humans are equal in fundamental worth or social status, according to the Stanford Encyclopedia of Philosophy. According to the Merriam-Webster Dictionary, the term has two distinct definitions in modern English: either as a political doctrine that all people should be treated as equals and have the same political, economic, social, and civil rights; or as a social philosophy advocating the removal of economic inequalities among people, economic egalitarianism, or the decentralization of power. Some sources define egalitarianism as the point of view that equality reflects the natural state of humanity." (DBpedia, 2017)
definition: "L'égalitarisme est une doctrine politique prônant l'égalité des citoyens en matière politique, économique et/ou sociale, selon les contextes. Dans le sens vulgaire, l'égalitarisme désigne plus particulièrement la doctrine qui a pour valeur politique suprême l'égalité matérielle de tous." (DBpedia, 2017) @fr
in scheme: political affiliation
related: activist for women and children

Egyptian nationalism
in dataset: The CWRC Ontology
type: political affiliation
type: Concept
comment: The description for this term is indebted to DBpedia.
label: nationalisme égyptien @fr
broader transitive: nationalism
definition: "Egyptian nationalism refers to the nationalism of Egyptians and Egyptian culture. Egyptian nationalism has typically been a civic nationalism that has emphasised the unity of Egyptians regardless of ethnicity or religion. Egyptian nationalism first manifested itself in Pharaonism beginning in the 19th century that identified Egypt as being a unique and independent political unit in the world since the era of the Pharaohs in ancient Egypt. Both the Arabic language spoken in modern Egypt and the ancient Egyptian language are Afroasiatic languages. The rule of Muhammad Ali of Egypt led Egypt into an advanced level of socioeconomic development in comparison with Egypt's neighbours, which along with the discoveries of relics of ancient Egyptian civilization, helped to foster Egyptian identity and Egyptian nationalism. The Urabi movement in the 1870s and 1880s was the first major Egyptian nationalist movement that demanded an end to the alleged despotism of the Muhammed Ali family and demanded curbing the growth of European influence in Egypt. It campaigned under the nationalist slogan of "Egypt for Egyptians". After the British occupation of Egypt in 1882, Egyptian nationalism became focused upon ending British colonial rule. Egyptian nationalism reached its peak in popularity in 1919 when revolution against British rule took place in response to wartime deprivations imposed by the British upon Egypt during World War I. Three years of protest and political turmoil followed until Britain unilaterally declared the independence of Egypt in 1922 that was a monarchy, though Britain reserved several areas for British supervision. During the period of the Kingdom of Egypt, Egyptian nationalists remained determined to terminate the remaining British presence in Egypt. Though Arab nationalism rose as a political force in the 1930s, there remained a strong regional attachment to Egypt by those who advocated cooperation with other Arab or Muslim neighbours. After the Egyptian Revo…
in scheme: political affiliation

elder care activist
in dataset: The CWRC Ontology
type: political affiliation
type: Concept
comment: The description for this term is indebted to DBpedia.
label: droit des personnes âgées @fr
label: elder rights
broader transitive: civil rights
definition: "Elder rights are the rights of the aged, who in the United States are not recognized as a constitutionally protected class. Common rights issues faced by elders include age-related job discrimination (such as forced age of retirement), lack of access to medical treatments because of age or age-related obstacles, societal perceptions of ability/disability due to age, and vulnerability to abuse, including financial, physical, psychological, social, and sexual because of diminished capacity and lack of access to/ability to use technology." (DBpedia, 2017)
in scheme: political affiliation

England
is replaced by: England
in dataset: The CWRC Ontology
type: Thing
type: Concept
comment: Deprecated in favour of instance England.
comment: Désapprouver en faveur de l'instance Angleterre. @fr
label: Angleterre @fr
deprecated: true
term status: deprecated
broader: english
in scheme: geographic heritage
name: England (Geographical Heritage)

England
is replaced by: english
in dataset: The CWRC Ontology
has literal form: Angleterre @fr
has literal form: England
type: textual label
comment: Deprecated in favour of instance english identity.
comment: Désapprouver en faveur de l'instance identité anglais. @fr
label: Angleterre @fr
deprecated: true
one of: England
term status: deprecated
in scheme: textual label

England
in dataset: The CWRC Ontology
type: geographic heritage
type: Thing
type: Concept
label: Angleterre @fr
broader: english
definition: Indicates a subject's identification with or labeling as of English heritage in relation to a place, often England.
in scheme: geographic heritage
name: England (Geographic Heritage)

english
in dataset: The CWRC Ontology
has literal form: anglais @fr
has literal form: english
type: textual label
type: Concept
label: english identity
label: identité anglais @fr
one of: English
one of: eng
one of: England
definition: A subclass of textual label, this discursive label reflects the ambiguity of Englishness associated with different cultural forms. It provides a means of aggregating and searching multiple instances of "English" (e.g. English, England) cultural identities.
in scheme: textual label
narrower: eng

English
in dataset: The CWRC Ontology
type: national heritage
type: Concept
label: Anglais @fr
broader: english
definition: Indicates a subject's identification with or labelling as English as an inherited national identity.

English
in dataset: The CWRC Ontology
type: nationality
type: Concept
label: Anglais @fr
broader: english
definition: Indicates a subject's identification with or labelling as English as a national identity.
in scheme: nationality

entrepreneurial industrialism
is replaced by: entrepreneurial
in dataset: The CWRC Ontology
type: Concept
comment: Deprecated in favour of instance .
comment: Désapprouver en faveur de l'instance . @fr
label: entrepreneuriat industriel @fr
deprecated: true
term status: deprecated

entrepreneurial
in dataset: The CWRC Ontology
type: social class
type: Concept
label: propriétaire industriel @fr
definition: Cette classe comprend les grands/es propriétaires industriels/les tels que les directeurs/trices d’usines, ceux/celles qui soutiennent les entreprises en y investissant des fonds, ou leurs épouses et leurs filles comme Elizabeth Montagu ou Beatrice Webb, en particulier pour les périodes historiques les plus reculées durant lesquelles il était rare que les femmes soient des acteurs financiers. @fr
definition: This class comprises the owners of large-scale enterprises such as factories, those who back such enterprises through investing money, or especially in the earlier historical periods when women were rarely economic agents, the wives and daughters of those who do, for instance, Elizabeth Montagu or Beatrice Webb.(brown_orlando, 2006)
in scheme: social class

ecologist
in dataset: The CWRC Ontology
type: political affiliation
type: Concept
value: environmentalist
value: nature conservationist
comment: La description de ce terme est basée sur celle de DBPedia. @fr
comment: The description for this term is indebted to DBpedia.
label: environmentalism
label: Écologisme @fr
definition: "Environmentalism or environmental rights is a broad philosophy, ideology, and social movement regarding concerns for environmental protection and improvement of the health of the environment, particularly as the measure for this health seeks to incorporate the concerns of non-human elements. Environmentalism advocates the lawful preservation, restoration and/or improvement of the natural environment, and may be referred to as a movement to control pollution or protect plant and animal diversity. For this reason, concepts such as a land ethic, environmental ethics, biodiversity, ecology, and the biophilia hypothesis figure predominantly. At its crux, environmentalism is an attempt to balance relations between humans and the various natural systems on which they depend in such a way that all the components are accorded a proper degree of sustainability. The exact measures and outcomes of this balance is controversial and there are many different ways for environmental concerns to be expressed in practice. Environmentalism and environmental concerns are often represented by the color green, but this association has been appropriated by the marketing industries for the tactic known as greenwashing. Environmentalism is opposed by anti-environmentalism, which says that the Earth is less fragile than some environmentalists maintain, and portrays environmentalism as overreacting to the human contribution to climate change or opposing human advancement." (DBpedia, 2017)
definition: "L'écologisme, ou environnementalisme, est à la fois un courant de pensée (idéologie ou philosophie), un corpus de valeurs et de propositions incluant notamment celles du mouvement écologiste. L'orientation de l'activité politique ou parapolitique vise au respect, à la protection, la préservation ou la restauration de l'environnement dans une forme très poussée. James Lovelock, père de la théorie Gaïa, est l'un des représentants les plus célèbres de cette doctrine. Ce mouvement éco-centrique a comme projet la conservation de la nature et le «respect» des équilibres naturels. L'environnementalisme et le mouvement écologiste ont parmi leurs priorités : la conservation des ressources naturelles, la préservation de la «vie sauvage» (wilderness), la lutte contre la dégradation, la fragmentation et la destruction des habitats et des écosystèmes au sens le plus large. Ils définissent de nouveaux rapports territoriaux dans les milieux habités par l'humain, dont les milieux urbains considérés comme les habitats potentiels de substitution et comme cadre de vie d'une part grandissante de l'humanité. Ces différentes demandes sociales et politiques, ou même protestations s'expriment dès le début du XXe siècle : en 1902, une convention internationale pour la protection des oiseaux utiles était signée entre 11 pays d'Europe, et en 1913, le congrès de Berne réclamait une «Protection mondiale de la nature», principalement du constat de la dégradation de la nature par l'homme, notamment par la chasse et la surexploitation de la nature, puis par la pollution et la destruction à grande échelle de milieux naturels (forêts tropicales) notamment." (DBpedia, 2017) @fr
in scheme: political affiliation

eugenicist
in dataset: The CWRC Ontology
type: political affiliation
type: Concept
comment: La description de ce terme est basée sur celle de DBPedia. @fr
comment: The description for this term is indebted to DBpedia.
label: Eugénisme @fr
label: eugenics
definition: "Eugenics (/juːˈdʒɛnɪks/; from Greek εὐγενής eugenes "well-born" from εὖ eu, "good, well" and γένος genos, "race, stock, kin") is a set of beliefs and practices that aims at improving the genetic quality of the human population. It is a social philosophy advocating the improvement of human genetic traits through the promotion of higher rates of sexual reproduction for people with desired traits (positive eugenics), or reduced rates of sexual reproduction and sterilization of people with less-desired or undesired traits (negative eugenics), or both. Alternatively, gene selection rather than "people selection" has recently been made possible through advances in genome editing (e.g. CRISPR). The exact definition of eugenics has been a matter of debate since the term was coined. The definition of it as a "social philosophy"—that is, a philosophy with implications for social order—is not universally accepted, and was taken from Frederick Osborn's 1937 journal article "Development of a Eugenic Philosophy". While eugenic principles have been practiced as far back in world history as Ancient Greece, the modern history of eugenics began in the early 20th century when a popular eugenics movement emerged in the United Kingdom and spread to many countries, including the United States, Canada and most European countries. In this period, eugenic ideas were espoused across the political spectrum. Consequently, many countries adopted eugenic policies meant to improve the genetic stock of their countries. Such programs often included both "positive" measures, such as encouraging individuals deemed particularly "fit" to reproduce, and "negative" measures such as marriage prohibitions and forced sterilization of people deemed unfit for reproduction. People deemed unfit to reproduce often included people with mental or physical disabilities, people who scored in the low ranges of different IQ tests, criminals and deviants, and members of disfavored minority groups. The eugenics movemen…
definition: "L’eugénisme peut être défini comme l’ensemble des méthodes et pratiques visant à intervenir sur le patrimoine génétique de l’espèce humaine, dans le but de le faire tendre vers un idéal déterminé, du moins tel que conçu à l'époque en cours. Il peut être le fruit d’une politique délibérément menée par un État. Il peut aussi être le résultat collectif d’une somme de décisions individuelles convergentes prises par les futurs parents, dans une culture qui valoriserait la recherche de l’«enfant parfait». Le terme eugenics a été employé pour la première fois en 1883 par le scientifique britannique Francis Galton. Les travaux de celui-ci participèrent à la constitution et à la diffusion de la mouvance eugéniste. Mené par des scientifiques et des médecins, le mouvement de promotion de l'eugénisme qui se met en place au tournant du XXe siècle milite en faveur de politiques volontaristes d'éradication des caractères jugés handicapants ou dans le but de favoriser des caractères jugés bénéfiques. Son influence sur la législation s’est traduite principalement dans trois domaines : la mise en place de programmes de stérilisations contraintes là où la culture dominante le permettait, un durcissement de l’encadrement juridique du mariage et des mesures de restriction ou promotion de tel ou tel type d’immigration. Dans la période contemporaine, les progrès du génie génétique et le développement des techniques de procréation médicalement assistée ont ouvert de nouvelles possibilités médicales (diagnostic prénatal, diagnostic préimplantatoire…) qui ont nourri les débats éthiques concernant la convergence des techniques biomédicales et des pratiques sélectives. Singapour a mis en place, ainsi que la Chine, un système qualifié d'eugéniste." (DBpedia, 2017) @fr
in scheme: political affiliation

Eurasian identity
in dataset: The CWRC Ontology
has literal form: eurasian
has literal form: eurasien @fr
type: textual label
type: Concept
label: identité Eurasian @fr
one of: eurasian
definition: A subclass of textual label, this discursive label reflects the ambiguity of the term eurasian as associated with different cultural forms. It provides a means of aggregating and searching multiple instances of "Eurasian" (e.g. eurasianGeographicHeritage, eurasianRace) cultural identities.
in scheme: textual label
narrower: eurasian

eurasian
in dataset: The CWRC Ontology
type: race or colour
type: Thing
type: Concept
label: eurasien @fr
subclass of: Eurasian identity
broader: Eurasian identity
definition: A Eurasian is a person of mixed Asian and European ancestry. In 19th-century British India, Eurasians — later called Anglo-Indians — were of mixed Portuguese, Dutch, British, Indian or, more rarely, French descent, but now their parentage may be from other parts of South, East or Southeast Asia. The term has been used in anthropological literature since the 1960s. It may also be extended to those with Central Asian heritage.
in scheme: race or colour
name: eurasian (race colour)

European
in dataset: The CWRC Ontology
type: ethnicity
type: Concept
label: Européen @fr
definition: "The ethnic groups in Europe are the focus of European ethnology, the field of anthropology related to the various ethnic groups that reside in the nations of Europe. According to German monograph Minderheitenrechte in Europa co-edited by Pan and Pfeil (2002) there are 87 distinct peoples of Europe, of which 33 form the majority population in at least one sovereign state, while the remaining 54 constitute ethnic minorities. The total number of national minority populations in Europe is estimated at 105 million people, or 14% of 770 million Europeans." (DBpedia, 2017)
definition: Les Européens sont les habitants de l'Europe. Au sens anthropologique, ils peuvent, plus simplement, être désignés par leur couleur de peau, c'est-à-dire comme «Blancs», bien que ce dernier terme soit moins précis car n'étant pas exclusif aux populations européennes. Du fait de la colonisation et de l'émigration européennes durant les siècles passés, de nombreux Européens ont quitté l'Europe, et le monde d'aujourd’hui se caractérise par une 'diaspora' européenne dans de nombreux pays (Amérique du Nord, Australie, Nouvelle-Zélande, pays du Sud de l'Amérique latine…), qui forment le monde occidental. Ce gentilé peut aussi désigner, selon une conception strictement géographique, les habitants du continent européen ; on peut plus rarement désigner comme Européens les citoyens de l'Union européenne (même si tout Européen n'est pas nécessairement citoyen de l'Union Européenne). Wikipédia @fr
in scheme: ethnicity

existentialist
in dataset: The CWRC Ontology
type: political affiliation
type: Concept
comment: La description de ce terme est basée sur celle de DBPedia. @fr
comment: The description for this term is indebted to DBpedia.
label: Existentialisme @fr
label: existentialism
definition: "Existentialism (/ɛɡzɪˈstɛnʃəlɪzəm/) is a term applied to the work of certain late-19th- and 20th-century European philosophers who, despite profound doctrinal differences, shared the belief that philosophical thinking begins with the human subject—not merely the thinking subject, but the acting, feeling, living human individual. While the predominant value of existentialist thought is commonly acknowledged to be freedom, its primary virtue is authenticity. In the view of the existentialist, the individual's starting point is characterized by what has been called "the existential attitude", or a sense of disorientation and confusion in the face of an apparently meaningless or absurd world. Many existentialists have also regarded traditional systematic or academic philosophies, in both style and content, as too abstract and remote from concrete human experience. Søren Kierkegaard is generally considered to have been the first existentialist philosopher, though he did not use the term existentialism. He proposed that each individual—not society or religion—is solely responsible for giving meaning to life and living it passionately and sincerely, or "authentically". Existentialism became popular in the years following World War II, and strongly influenced many disciplines besides philosophy, including theology, drama, art, literature, and psychology." (DBpedia, 2017)
definition: "L’existentialisme est un courant philosophique ainsi que littéraire qui postule que l'être humain forme l'essence de sa vie par ses propres actions, celles-ci n'étant pas prédéterminées par des doctrines théologiques, philosophiques ou morales. L'existentialisme considère chaque personne comme un être unique maître de ses actes, de son destin et des valeurs qu'il décide d'adopter. Bien qu'il existe des tendances communes entre les penseurs existentialistes, des différences subsistent : il y a notamment un fossé entre les existentialistes athées comme Jean-Paul Sartre et les philosophes existentiels chrétiens comme Søren Kierkegaard, Paul Tillich ou Gabriel Marcel, sans oublier la philosophie juive de l'existence de Martin Buber et Emmanuel Levinas ou encore musulmane d'Abdennour Bidar. Certains auteurs tels que Albert Camus ou Martin Heidegger ont même refusé d'être étiquetés comme existentialistes. Sartre a livré quant à lui sa propre définition et conception de l'existentialisme et a donné une conférence sur le sujet : L'existentialisme est un humanisme." (DBpedia, 2017) @fr
in scheme: political affiliation

fascist
in dataset: The CWRC Ontology
type: political affiliation
type: Concept
value: fascist party
value: pro-fascist
comment: La description de ce terme est basée sur celle de DBPedia. @fr
comment: The description for this term is indebted to DBpedia.
label: Fascisme @fr
label: fascism
definition: "Fascism /ˈfæʃɪzəm/ is a form of radical authoritarian nationalism that came to prominence in early 20th-century Europe, influenced by national syndicalism. Fascism originated in Italy during World War I and spread to other European countries. Fascism opposes liberalism, Marxism and anarchism and is usually placed on the far-right within the traditional left–right spectrum. Fascists saw World War I as a revolution that brought massive changes in the nature of war, society, the state, and technology. The advent of total war and total mass mobilization of society had broken down the distinction between civilian and combatant. A "military citizenship" arose in which all citizens were involved with the military in some manner during the war. The war had resulted in the rise of a powerful state capable of mobilizing millions of people to serve on the front lines and providing economic production and logistics to support them, as well as having unprecedented authority to intervene in the lives of citizens. Fascists believe that liberal democracy is obsolete, and they regard the complete mobilization of society under a totalitarian one-party state as necessary to prepare a nation for armed conflict and to respond effectively to economic difficulties. Such a state is led by a strong leader—such as a dictator and a martial government composed of the members of the governing fascist party—to forge national unity and maintain a stable and orderly society. Fascism rejects assertions that violence is automatically negative in nature, and views political violence, war, and imperialism as means that can achieve national rejuvenation. Fascists advocate a mixed economy, with the principal goal of achieving autarky through protectionist and interventionist economic policies. Since the end of World War II in 1945, few parties have openly described themselves as fascist, and the term is instead now usually used pejoratively by political opponents. The descriptions neo-fascist or post-f…
definition: "Le terme fascisme (prononcé [fa.ʃism], calque de la prononciation italienne [faˈʃizmo] ; ou plus rarement [fa.sism]) s'applique au sens étroit à la période mussolinienne de l'histoire italienne et au sens large à un système politique aux caractéristiques inspirées par l'exemple italien mais qui a pu prendre des aspects différents selon les pays. Des débats existent entre les historiens quant à la qualification de certains régimes (France de Vichy, Espagne franquiste...). Le terme même (en italien fascismo) vient du mot «fascio» («faisceau») désignant le rassemblement des fusils au repos ou l'attribut du licteur dans la Rome antique. La différence entre fascisme et totalitarisme fait l'objet de nombreux débats. Le fascisme est un système politique autoritaire qui associe populisme, nationalisme et totalitarisme au nom d'un idéal collectif suprême. À la fois révolutionnaire et conservateur, il s'oppose frontalement à la démocratie parlementaire et à l'État libéral garant des droits individuels. Issu de diverses composantes de la philosophie européenne du XIXe siècle, le fascisme a trouvé dans les circonstances économiques et historiques de l'après-première guerre mondiale le contexte qui lui a permis d'accéder au pouvoir, d'abord en Italie dans les années 1920 avec Mussolini, puis sous une variante accentuée, militariste et terroriste, en Allemagne dans les années 1930 avec le nazisme et Hitler. Niant l'individu et la démocratie au nom de la masse incarnée dans un chef providentiel, le fascisme embrigade les groupes sociaux (jeunesse, milices) et justifie la violence d'État menée contre les opposants assimilés à des ennemis intérieurs, l'unité de la nation devant dépasser et résoudre les antagonismes des classes sociales dans un parti unique. Dans le domaine économique, l'état conduit une politique dirigiste mais maintient la propriété privée et capitaliste.En même temps il rejette la notion d'égalité au nom d'un ordre hiérarchique naturel : il définit un «homme nouv… @fr
in scheme: political affiliation

FATHER
in dataset: The CWRC Ontology
type: ObjectProperty
label: father of
label: père de @fr
sub property of: PARENTS

Female
is replaced by: Woman/Female
in dataset: The CWRC Ontology
type: Thing
type: Concept
comment: Deprecated in favour of instance Woman/Female.
comment: Désapprouver en faveur de l'instance Femme/Femelle. @fr
label: Femelle @fr
deprecated: true
term status: deprecated
name: Female (Sex)

activist for women and children
in dataset: The CWRC Ontology
type: political affiliation
type: Concept
value: anti-sexist
value: equal rights
value: feminist
value: gender egalitarian
value: health activist
value: moderate feminist
value: pro-family
value: proto-feminist
value: salary reform
value: women's rights
comment: La description de ce terme est basée sur celle de DBPedia. @fr
comment: The description for this term is indebted to DBpedia.
label: Féminisme @fr
label: feminism
broader transitive: civil rights
definition: "Feminism is a range of political movements, ideologies, and social movements that share a common goal: to define, establish, and achieve political, economic, personal, and social rights for women that are equal to those of men. This includes seeking to establish equal opportunities for women in education and employment. Feminist movements have campaigned and continue to campaign for women's rights, including the right to vote, to hold public office, to work, to earn fair wages or equal pay, to own property, to receive education, to enter contracts, to have equal rights within marriage, and to have maternity leave. Feminists have also worked to promote bodily autonomy and integrity, and to protect women and girls from rape, sexual harassment, and domestic violence. Feminist campaigns are generally considered to be one of the main forces behind major historical societal changes for women's rights, particularly in the West, where they are near-universally credited with having achieved women's suffrage, gender neutrality in English, reproductive rights for women (including access to contraceptives and abortion), and the right to enter into contracts and own property. Although feminist advocacy is, and has been, mainly focused on women's rights, some feminists, including bell hooks, argue for the inclusion of men's liberation within its aims because men are also harmed by traditional gender roles. Feminist theory, which emerged from feminist movements, aims to understand the nature of gender inequality by examining women's social roles and lived experience; it has developed theories in a variety of disciplines in order to respond to issues concerning gender. Numerous feminist movements and ideologies have developed over the years and represent different viewpoints and aims. Some forms of feminism have been criticized for taking into account only white, middle class, and educated perspectives. This criticism led to the creation of ethnically specific or multicultural for…
definition: "Le féminisme est un ensemble de mouvements et d'idées politiques, philosophiques et sociales, qui partagent un but commun : définir, établir et atteindre l'égalité politique, économique, culturelle, personnelle, sociale et juridique entre les femmes et les hommes. Le féminisme a donc pour objectif d'abolir, dans ces différents domaines, les inégalités homme-femme dont les femmes sont les principales victimes, et ainsi de promouvoir les droits des femmes dans la société civile et dans la sphère privée. Si le terme «féminisme» ne prend son sens actuel qu'à la fin du XIXe siècle, les idées de libération de la femme prennent leurs racines dans le siècle des Lumières et se réclament de mouvements plus anciens ou de combats menés dans d'autres contextes historiques. L’objectif principal de la première vague féministe est de réformer les institutions, de sorte que les hommes et les femmes deviennent égaux devant la loi : droit à l'éducation, droit au travail, droit à la maîtrise de leurs biens et droit de vote des femmes constituent les revendications principales de cette période. Le mouvement féministe a produit une grande diversité d'analyses sociologiques et philosophiques. La deuxième vague féministe, qui intervient à la fin des années 1960 avec la naissance du Mouvement de libération des femmes (MLF) et du Women's Lib, a ainsi élaboré plusieurs concepts qui entendent rendre compte de la spécificité du rapport de domination exercé sur les femmes. C'est à cette période qu'est reformulé le concept de patriarcat, élaboré celui de sexisme et que l'accent est mis sur la sphère privée comme lieu privilégié de la domination masculine : le «privé est politique». Les revendications touchant au contrôle de leur corps par les femmes (avortement, contraception) sont placées au premier plan mais, plus largement, c'est à la construction de nouveaux rapports sociaux de sexe qu'appellent les féministes de cette deuxième vague. Dans cette perspective, la notion de «genre» entend «déna… @fr
in scheme: political affiliation

anti-female-genital-mutilation
in dataset: The CWRC Ontology
type: political affiliation
type: Concept
comment: The description for this term is indebted to DBpedia.
label: feminist anti-violence activism
label: féminisme contre la violence @fr
broader transitive: activist for women and children
definition: Activism opposing violence from a feminist perspective, often but not exclusively violence against women and children, including sexual and domestic violence and female genital mutilation.
definition: Lutte contre la violence dans une perspection féministe, souvent mais non exclusivement dans le cadre des violences envers les femmes et les enfants, incuant les violences sexuelles et conjugales et les mutilations génitales féminines. @fr
in scheme: political affiliation

feminist internationalism
in dataset: The CWRC Ontology
type: political affiliation
type: Concept
comment: The description for this term is indebted to DBpedia.
label: féminisme internationaliste @fr
broader transitive: activist for women and children
broader transitive: internationalist
definition: Feminist participant in the internationalism movement. See Internationalism (politics) - Wikipedia
definition: Féminisme en lien avec le mouvement internationaliste. Voir Internationalisme — Wikipédia @fr
in scheme: political affiliation

feminist pacifism
in dataset: The CWRC Ontology
type: political affiliation
type: Concept
comment: The description for this term is indebted to DBpedia.
label: féminisme pacifiste @fr
broader transitive: activist for women and children
broader transitive: pacifist
definition: Feminist participant in the pacifist movement. See Internationalism (politics) - Wikipedia Also see: Pacifism - Wikipedia
definition: Féminisme en lien avec le mouvement pacifiste. Voir Pacifisme — Wikipédia @fr
in scheme: political affiliation

Fifth Monarchists
in dataset: The CWRC Ontology
type: religion
type: Concept
type: Organization
comment: La description de ce terme est basée sur celle de DBPedia. @fr
comment: The description for this term is indebted to DBpedia.
label: Cinquièmes Monarchistes @fr
broader transitive: Dissent (Protestant)
broader transitive: Millenarianism
definition: "Les hommes de la Cinquième Monarchie, ou Cinquièmes Monarchistes (Fifth Monarchy Men ou Fifth Monarchists en anglais) sont une faction idéologique de la Première Révolution anglaise, active de 1649 à 1661. Ils tiennent leur nom de leur croyance en la fondation prochaine d'un royaume planétaire par Jésus retournant sur terre." (DBpedia, 2017) @fr
definition: "The Fifth Monarchists or Fifth Monarchy Men were active from 1649 to 1660 during the Interregnum, following the English Civil Wars of the 17th century. They took their name from a prophecy in the Book of Daniel that four ancient monarchies (Babylonian, Persian, Macedonian, and Roman) would precede the kingdom of Christ. They also referred to the year 1666 and its relationship to the biblical Number of the Beast indicating the end of earthly rule by carnal human beings. They were one of a number of nonconformist dissenting groups that emerged around this time." (DBpedia, 2017)
in scheme: religion

FOREBEAR
in dataset: The CWRC Ontology
type: ObjectProperty
label: ancêtre de @fr
label: forebear of
sub property of: FAMILY

free trader
in dataset: The CWRC Ontology
type: political affiliation
type: Concept
comment: The description for this term is indebted to DBpedia.
label: free trade movement
label: mouvement pour le libre-échange @fr
definition: "Free Trader was a political label used in the United Kingdom by several candidates in the 1906 general election and January 1910 general election. Its candidates were in university constituencies, led by John Eldon Gorst, who had been previously elected as a Conservative Party but had split from the party in 1902. The group was in favour of limited social reforms, and in particular of free trade. While several of its candidates received substantial votes, none were elected, and in 1910 Gorst stood instead as a Liberal Party candidate, the remainder of the grouping soon petering out." (DBpedia, 2017)
in scheme: political affiliation

French nationalism
in dataset: The CWRC Ontology
type: political affiliation
type: Concept
comment: La description de ce terme est basée sur celle de DBPedia. @fr
comment: The description for this term is indebted to DBpedia.
label: Nationalisme en France @fr
broader transitive: nationalism
definition: "French nationalism is the nationalism that asserts that the French are a nation and promotes the cultural unity of the French." (DBpedia, 2017)
definition: "Le nationalisme en France est apparu au cours du XVIIIe siècle dans la bourgeoisie, sous la plume des philosophes des Lumières. Le nationalisme signifiait pour eux, à cette époque, que c'est le peuple qui incarne le pays, par opposition à la vision de l'ancien régime pour lequel le pays est incarné par le Roi de France. Au XIXe siècle, le nationalisme devient une opposition aux autres nations, voire aux autres peuples, cette idée prenant clairement forme à la fin de ce siècle, dans les mouvements politiques entrant en jeu dans le système démocratique français, est née en 1870, avec la Troisième République. À cette époque, tous les partis manifestent ostensiblement de telles idées nationalistes et anti-allemandes : la Prusse venait de gagner une guerre et avait pris l'Alsace-Lorraine." (DBpedia, 2017) @fr
in scheme: political affiliation

gay rights advocate
in dataset: The CWRC Ontology
type: political affiliation
type: Concept
value: pro-sexual preference
comment: La description de ce terme est basée sur celle de DBPedia. @fr
comment: The description for this term is indebted to DBpedia.
label: Mouvement LGBT @fr
label: gay rights movement
broader transitive: civil rights
definition: "Le mouvement lesbien, gay, bisexuel et transsexuel (LGBT) désigne l'ensemble des mouvements et actions individuelles ou collectives qui cherchent à faire évoluer la perception sociale des minorités sexuelles, de l'homosexualité, de la bisexualité et de la transsexualité. Un objectif fréquemment avancé par ces mouvements est l'égalité des droits civils et sociaux pour les personnes LGBT et, parfois, la construction de communautés LGBT ou la libération de l'ensemble de la société de la biphobie, de l'homophobie et de la transphobie. Il n'existe pas d'organisation qui regroupe l'ensemble des LGBT et de nombreuses structures existent dans différents pays à travers le monde. Le mouvement se concrétise notamment par des actions militantes, culturelles et artistiques ou des manifestations de rue telle que la Marche des fiertés." (DBpedia, 2017) @fr
definition: "Lesbian, gay, bisexual, transgender, and queer (LGBTQ) social movements are social movements that advocate for the equalized acceptance of LGBT people in society. In these movements, LGBTQ people and their allies have a long history of campaigning for what is now generally called LGBTQ rights, sometimes also called gay rights or gay and lesbian rights. Although there is not a primary or an overarching central organisation that represents all LGBT people and their interests, numerous LGBT rights organisations are active worldwide. The earliest organisations to support LGBT rights were formed in the 19th century. A commonly stated goal among these movements is social equality for LGBT people. Some have also focused on building LGBT communities or worked towards liberation for the broader society from biphobia, homophobia, and transphobia. LGBT movements organized today are made up of a wide range of political activism and cultural activity, including lobbying, street marches, social groups, media, art, and research." (DBpedia, 2017)
in scheme: political affiliation

man/male
is replaced by: man
in dataset: The CWRC Ontology
type: Thing
type: Concept
comment: Deprecated in favour of instance man.
comment: Désapprouver en faveur de l'instance homme. @fr
label: homme/mâle @fr
deprecated: true
term status: deprecated
name: man/male (gender)

Transman/Transmale
is replaced by: transman/transmale
in dataset: The CWRC Ontology
type: Concept
comment: Deprecated in favour of instance transman/transmale.
comment: Désapprouver en faveur de l'instance homme trans. @fr
label: Homme Trans @fr
deprecated: true
term status: deprecated
name: Transman/Transmale (gender)

Transwoman/Transfemale
is replaced by: transwoman/transfemale
in dataset: The CWRC Ontology
type: Concept
comment: Deprecated in favour of instance transwoman/transfemale.
comment: Désapprouver en faveur de l'instance femme trans. @fr
label: Femme Trans @fr
deprecated: true
term status: deprecated
name: Transwoman/Transfemale (gender)

Woman/Female
is replaced by: woman
in dataset: The CWRC Ontology
type: Thing
type: Concept
comment: Deprecated in favour of instance woman.
comment: Désapprouver en faveur de l'instance femme. @fr
label: Femme/Femelle @fr
deprecated: true
term status: deprecated
name: Woman/Female (gender)

gentry
in dataset: The CWRC Ontology
type: social class
type: Concept
label: bourgeoisie @fr
definition: L’appartenance à la bourgeoisie indique la possession d’une propriété, qui peut être une terre ou des actions. Cela «commence par la possession d’armes, et ensuite d’armoiries, mais se distingue de la noblesse en cela que l’argent n’est pas nécessairement lié au sang et au titre. Les gentlemen désintéressés sont membres de cette classe (i.e. Mr Bennett dans Jane Austen).» Même si elles ne possèdent pas beaucoup de biens qui leur soient propres, les dames appartiennent également à cette classe, notamment lorsqu’elles sont entretenues par a père ou un frère, ou lorsqu’elles sont sinistrées, ou rendues pauvres, comme c’est le cas de Jane Eyre ou Jane Fairfax de Austen. @fr
definition: Membership in the gentry indicates property-ownership or relation to the same; property can be land or stocks and bonds. It "begins in the idea of owning arms and having a coat of arms, but is distinguished from nobility insofar as money is not necessarily related to blood and title. Disinterested gentlemen are of this class (i.e. Mr. Bennett in Jane Austen).("(brown_orlando, 2006)")Gentlewomen belong to this class, even though they may not themselves own much property but instead be supported by a father or brother, or they may be distressed, which is to say, impoverished gentlewomen, as in the case of Jane Eyre or Austen's Jane Fairfax.
in scheme: social class

German nationalism
in dataset: The CWRC Ontology
type: political affiliation
type: Concept
comment: The description for this term is indebted to DBpedia.
label: nationalisme allemand @fr
broader transitive: nationalism
definition: "German nationalism is the idea that asserts that Germans are a nation and promotes the cultural unity of Germans. The earliest origins of German nationalism began with the birth of Romantic nationalism during the Napoleonic Wars when Pan-Germanism started to rise. Advocacy of a German nation began to become an important political force in response to the invasion of German territories by France under Napoleon. After the rise and fall of Nazi Germany during World War II, German nationalism has been generally viewed in the country as taboo. However, during the Cold War, German nationalism arose that supported the reunification of East and West Germany that was achieved in 1990. German nationalism has faced difficulties in promoting a united German identity as well as facing opposition within Germany. The Catholic-Protestant divide in Germany at times created extreme tension and hostility between Catholic and Protestant Germans after 1871, such as in response to the policy of Kulturkampf in Prussia by German Chancellor and Prussian Prime Minister Otto von Bismarck, that sought to dismantle Catholic culture in Prussia, provoking outrage amongst Germany's Catholics and resulting in the rise of the pro-Catholic Centre Party and the Bavarian People's Party. There have been rival nationalists within Germany, particularly Bavarian nationalists who claim that the terms that Bavaria entered into Germany in 1871 were controversial and have claimed the German government has long intruded into the domestic affairs of Bavaria. Outside of modern-day Germany in Austria, there are Austrian nationalists who have rejected unification of Austria with Germany on the basis of preserving Austrians' Catholic religious identity from the potential danger posed by being part of a Protestant-majority Germany." (DBpedia, 2017)
in scheme: political affiliation

Girondin
in dataset: The CWRC Ontology
type: political affiliation
type: Concept
comment: La description de ce terme est basée sur celle de DBPedia. @fr
comment: The description for this term is indebted to DBpedia.
label: Gironde (Révolution française) @fr
definition: "Certains Girondins, comme Condorcet, Brissot, Roland, Guadet, Vergniaud, Isnard, Ducos et Buzot étaient des républicains convaincus. Ses membres, pour la plupart inscrits au club des Jacobins à Paris ou en province, constituaient l'aile la plus avancée de l'Assemblée législative, avant de représenter l'aile droite de la Convention nationale face aux Montagnards, qui étaient en force parmi les députés de Paris, et incarnés par les figures de Robespierre, Danton ou Marat. Les affrontements violents entre Girondins et Montagnards dominent les premiers mois de la Convention." (DBpedia, 2017) @fr
definition: "The Girondins or Girondists were members of the Gironba, a political group operating in France from 1791 to 1795 during the French Revolution. The Girondins were active within the Legislative Assembly and the National Convention. They were part of the Jacobin movement, though not every Girondin was a member of the Jacobin Club. The Girondins campaigned for the end of the monarchy but then resisted the spiraling momentum of the Revolution. They came into conflict with The Mountain (Montagnards), a radical faction within the Jacobin Club. This conflict eventually led to the fall of the Girondins and their mass execution, the beginning of the Reign of Terror. The Girondins comprised a group of loosely affiliated individuals rather than an organized political party, and the name was at first informally applied because the most prominent exponents of their point of view were deputies to the Legislative Assembly from the department of Gironde in southwest France. The term became standard with Lamartine's history in 1847. Girondin leader Jacques-Pierre Brissot proposed an ambitious military plan to spread the Revolution—one that Napoleon later achieved. He called on the Convention to dominate Western Europe by conquering the Rhineland, Poland, and Holland, with a goal of creating a protective ring of satellite republics in Britain, Spain and Italy by 1795. The Girondins were thus the war party in 1792–93. Other prominent Girondins included Jean Marie Roland and his wife Madame Roland. They had an ally in the English-born, sometime American, activist Thomas Paine. Brissot and Madame Roland were executed and Jean Roland (who had gone into hiding) committed suicide when he learned what had transpired. Paine was arrested and imprisoned but narrowly escaped execution. The famous painting Death of Marat depicts the killing of the fiery radical journalist (and denouncer of the Girondins) Jean-Paul Marat by the Girondin sympathizer Charlotte Corday, who was executed." (DBpedia, 2…
in scheme: political affiliation
related: jacobin

GRANDCHILD
in dataset: The CWRC Ontology
type: ObjectProperty
label: grand child of
label: petit enfant de @fr
sub property of: FAMILY

GRANDDAUGHTER
in dataset: The CWRC Ontology
type: ObjectProperty
label: granddaughter of
label: petite fille de @fr
sub property of: GRANDCHILD

GRANDFATHER
in dataset: The CWRC Ontology
type: ObjectProperty
label: grand-père de @fr
label: grandfather of
sub property of: GRANDPARENTS

GRANDMOTHER
in dataset: The CWRC Ontology
type: ObjectProperty
label: grand-mère de @fr
label: grandmother of
sub property of: GRANDPARENTS

GRANDPARENTS
in dataset: The CWRC Ontology
type: ObjectProperty
label: grand parent de @fr
label: grand parent of
sub property of: FAMILY

GRANDSON
in dataset: The CWRC Ontology
type: ObjectProperty
label: grandson of
label: petit fils de @fr
sub property of: GRANDCHILD

Greek nationalism
in dataset: The CWRC Ontology
type: political affiliation
type: Concept
comment: The description for this term is indebted to DBpedia.
label: nationliste grec @fr
broader transitive: nationalism
definition: "Greek nationalism (or Hellenic nationalism) refers to the nationalism of Greeks and Greek culture. As an ideology, Greek nationalism originated and evolved in pre-modern times. It became a major political movement beginning in the 18th century, which culminated in the Greek War of Independence (1821–1829) against the Ottoman Empire. It became a potent movement in Greece shortly prior to, and during World War I under the leadership of nationalist figure Eleutherios Venizelos who pursued the Megali Idea and managed to liberate Greece in the Balkan Wars and after World War I, briefly annexed the region of Izmir before it was retaken by Turkey. Today Greek nationalism remains important in the Greco-Turkish dispute over Cyprus." (DBpedia, 2017)
in scheme: political affiliation

GUARDIAN
in dataset: The CWRC Ontology
type: ObjectProperty
label: guardian of
label: tuteur (‑trice) / gardien (ne) @fr
sub property of: OTHER
definition: A (young) adult officially placed in charge of the care of a minor. (eg: in loco parentis)
definition: Une personne placé en charge du bienfait d'un personne mineure. @fr

Guelph party (Florence)
in dataset: The CWRC Ontology
type: political affiliation
type: Concept
comment: La description de ce terme est basée sur celle de DBPedia. @fr
comment: The description for this term is indebted to DBpedia.
label: Guelfes et gibelins @fr
definition: "Les guelfes et les gibelins sont deux factions (parti ou, plus souvent, brigate ou sette) médiévales qui s'opposèrent militairement, politiquement et culturellement dans l'Italie des Duecento et Trecento. À l'origine, elles soutenaient respectivement deux dynasties qui se disputaient le trône du Saint-Empire : la pars Guelfa appuyait les prétentions de la dynastie des «Welfs» et de la papauté, puis de la maison d'Anjou, la pars Gebellina, celles des Hohenstaufen, et au-delà celles du Saint-Empire. Conflit en apparence limité au Saint-Empire, l'opposition entre Guelfes et Gibelins va se transporter dans diverses parties d'Europe, principalement dans les villes de la péninsule italienne. Dans cette bipolarisation, parfois surestimée, les allégeances dynastiques sont parfois secondaires, les adhésions fluctuantes, et il faut attendre le règne de Frédéric II pour que papauté et empire deviennent des symboles forts de ralliement et que se construise une véritable division antithétique. Ce clivage trouve des manifestations dans le domaine civique et religieux et cristallise les tensions entre les villes italiennes, au sein de leurs élites et parfois entre la ville et son contado. L'écho du conflit se manifeste à des époques ultérieures, en revêtant de nouveaux caractères et en stigmatisant des oppositions idéologiques nouvelles." (DBpedia, 2017) @fr
definition: The Guelphs and Ghibellines were factions supporting the Pope and the Holy Roman Emperor, respectively, in the Italian city-states of Central and Northern Italy. During the 12th and 13th centuries, rivalry between these two parties formed a particularly important aspect of the internal politics of medieval Italy. The struggle for power between the Papacy and the Holy Roman Empire had arisen with the Investiture Controversy, which began in 1075 and ended with the Concordat of Worms in 1122. The division between the Guelphs and Ghibellines in Italy, however, persisted until the 15th century.
in scheme: political affiliation
related: catholic

House of Hanover
in dataset: The CWRC Ontology
type: political affiliation
type: Concept
comment: La description de ce terme est basée sur celle de DBPedia. @fr
comment: The description for this term is indebted to DBpedia.
label: Hanoverian
label: Maison de Hanovre @fr
definition: "La Maison de Hanovre est une dynastie royale allemande qui a régné sur le duché de Brunswick-Lunebourg (en allemand Braunschweig-Lüneburg), le royaume de Hanovre, le royaume de Grande-Bretagne, puis du Royaume-Uni. Elle succède à la Maison Stuart sur le trône britannique en 1714 et s'y maintient jusqu'à la mort de Victoria en 1901. Elle est parfois appelée Maison de Brunswick-Lüneburg. À la mort de Victoria, le trône du Royaume-Uni est passé dans la maison de Saxe-Cobourg-Gotha en la personne d'Édouard VII du Royaume-Uni, devenue la maison Windsor en 1917." (DBpedia, 2017) @fr
definition: "The House of Hanover is a German royal dynasty that ruled the Electorate and then the Kingdom of Hanover, and that also provided monarchs of Great Britain and Ireland from 1714 and ruled the United Kingdom until the death of Queen Victoria in 1901. The House of Hanover was formally named the House of Brunswick-Lüneburg, Hanover line, as it was originally a cadet branch of the House of Brunswick-Lüneburg. The senior branch became extinct in 1884, and the House of Hanover is now the only surviving branch of the House of Welf, which is the senior branch of the House of Este. The current head of the House of Hanover is Ernst August, Prince of Hanover." (DBpedia, 2017)
in scheme: political affiliation

has Actor
in dataset: The CWRC Ontology
type: ObjectProperty
domain: performance
label: a un acteur @fr
range: Agent
definition: Associates an event element to a person.

has award
in dataset: The CWRC Ontology
type: ObjectProperty
inverse of: awarded to

has Character
in dataset: The CWRC Ontology
type: ObjectProperty
domain: performance
label: a un personnage @fr
definition: Associates an event element to a (story) character.

has a cultural form
in dataset: The CWRC Ontology
type: ObjectProperty
label: a une forme culturelle @fr
definition: Associe des concepts et des catégories spécifiques au processus de formation identitaire par des processus culturels. Les sujets eux-mêmes peuvent ou ont pu s’approprier de telles associations, ou d’autres personnes les leur ont attribuées. Les concepts et les catégories classés dans forme culturelle se chevauchent pour les concepts et les étiquettes utilisés. @fr
definition: This associates specific concepts and categories with the process of identity formation through cultural processes. Such associations may be or have been embraced by the subject her/himself or attributed by others. The concepts and categories classed as a cultural form are understood to overlap with each other conceptually and in terms of the labels used.

has a cultural form
is replaced by: has a cultural form
in dataset: The CWRC Ontology
type: DeprecatedProperty
comment: Deprecated in favour of object property has a cultural form.
comment: Désapprouver en faveur de la propriété a une forme culturelle. @fr
label: a une forme culturelle @fr
equivalent property: has a cultural form
term status: deprecated
definition: Cette sous-classe de culturalFormation associe des concepts et des catégories spécifiques au processus de formation identitaire à travers les processus culturels. Le sujet elle/lui-même peut ou a pu s’approprier de telles associations, ou d’autres personnes les lui ont attribuées. Les concepts et les catégories classés dans culturalForms se chevauchent en théorie et en terme d'étiquettes utilisés. @fr
definition: This sub-class of culturalFormation associates specific concepts and categories with the process of identity formation through cultural processes. Such associations may be or have been embraced by the subject her/himself or attributed by others. The concepts and categories classed as culturalForms are understood to overlap with each other conceptually and in terms of the labels used.

has education
in dataset: The CWRC Ontology
type: ObjectProperty
domain: natural person
range: Education context

has ethnicity
in dataset: The CWRC Ontology
type: ObjectProperty
label: d'ethnicité @fr
range: ethnicity
sub property of: personal property
definition: Describes a person's ethnicity. As with other cultural forms, an individual may have more than one property or descriptor of this type. For further information about this property, see ethnicity.

has ethnicity (self defined)
is replaced by: has ethnicity (self reported)
in dataset: The CWRC Ontology
comment: Deprecated in favour of instance has ethnicity (self reported).
comment: Désapprouver en faveur de l'instance d'ethnicité (autodéclarée). @fr
label: d'ethnicité (autodéclarée) @fr
range: ethnicity
sub property of: personalPropertySelfDefined
deprecated: true
term status: deprecated

has ethnicity (self reported)
in dataset: The CWRC Ontology
type: ObjectProperty
label: d'ethnicité (autodéclarée) @fr
range: ethnicity
sub property of: personal property self-reported
definition: A subproperty of personal property self-reported for indicating a person's self-reported ethnicity, with accompanying context, where present, provided by race or ethnicity context annotations. For more information on this property, see ethnicity.
definition: Une sous-propriété de propriété personnelle autodéclarée qui indique l’ethnicité autodéclarée, accompagnée du contexte fourni par les annotations de contexte ethnique ou racial là ou il est disponible. Pour plus d’informations sur cette propriété, voir ethnicité. @fr

has Element
in dataset: The CWRC Ontology
type: ObjectProperty
domain: Event
label: a un élément @fr
range: performance
definition: Associates an event or event element.

has gender
in dataset: The CWRC Ontology
type: ObjectProperty
label: est de genre @fr
range: gender
sub property of: personal property
definition: Describes a person's gender. As with other cultural forms, an individual may have more than one property or descriptor of this type. For further information about this property, see gender.

has gender (self declared)
is replaced by: has gender (self reported)
in dataset: The CWRC Ontology
comment: Deprecated in favour of instance has gender (self reported).
comment: Désapprouver en faveur de l'instance est de genre (autodéclaré). @fr
label: est de genre (autodéclaré) @fr
range: gender
sub property of: personal property (self reported)
deprecated: true
term status: deprecated

has gender (self reported)
in dataset: The CWRC Ontology
type: ObjectProperty
label: est de genre (autodéclaré) @fr
range: gender
sub property of: personal property self-reported
definition: A personal property, this indicates a person's self-defined gender. For more information on this property, see gender.
definition: Une propriété personnelle, qui indique le genre autoproclamé d’une personne. Pour plus d’information, voir genre. @fr

has Geographic Heritage
in dataset: The CWRC Ontology
type: ObjectProperty
label: A un héritage géographique @fr
range: geographic heritage
sub property of: personal property
definition: Describes a person's heritage in relation to a place. Place names and boundaries change over time, and a conception of geographical heritage from one historical period may not be commensurate with those from an earlier or later period, even if they go by the same name. Similarly, a sense of geographical heritage may differ from a sense of identity with a political entity that goes by the same name. As with other cultural forms, an individual may have more than one property or descriptor of this type. For further information about this property, see .

has geographic heritage (self declared)
is replaced by: has geographic heritage (self reported)
in dataset: The CWRC Ontology
comment: Deprecated in favour of instance has geographic heritage (self reported).
comment: Désapprouver en faveur de l'instance a un héritage géographique (autodéclaré). @fr
label: a un héritage géographique (autodéclaré) @fr
range: geographic heritage
sub property of: personal property
deprecated: true
term status: deprecated

has geographic heritage (self reported)
in dataset: The CWRC Ontology
type: ObjectProperty
label: a un héritage géographique (autodéclaré) @fr
range: geographic heritage
sub property of: personal property self-reported
definition: This describes a person's self-reported geographic heritage.

language known
in dataset: The CWRC Ontology
type: ObjectProperty
label: connait la langue @fr
range: linguistic ability (spoken and/or writen)
sub property of: personal property
definition: Knowledge of the language for writing or reading.

language known (self declared)
is replaced by: language known (self reported)
in dataset: The CWRC Ontology
comment: Deprecated in favour of instance language known (self reported).
comment: Désapprouver en faveur de l'instance connait la langue (autodéclaré). @fr
label: connait la langue (autodéclaré) @fr
range: linguistic ability (spoken and/or writen)
sub property of: personal property (self reported)
deprecated: true
term status: deprecated

language known (self reported)
in dataset: The CWRC Ontology
type: ObjectProperty
label: connait la langue (autodéclaré) @fr
range: linguistic ability (spoken and/or writen)
sub property of: personal property self-reported

has national heritage
in dataset: The CWRC Ontology
type: ObjectProperty
label: de héritage national @fr
range: national heritage
sub property of: personal property
definition: Describes a person's national heritage. As with other cultural forms, an individual may have more than one property or descriptor of this type. For further information about this property, see national heritage.

has national heritage (self reported)
in dataset: The CWRC Ontology
type: ObjectProperty
label: de héritage national (autodéclarée) @fr
range: national heritage
sub property of: personal property self-reported
definition: Describes a person's self-reported national heritage. As with other cultural forms, an individual may have more than one property or descriptor of this type. For further information about this property, see national heritage.

has nationality
in dataset: The CWRC Ontology
type: ObjectProperty
label: de nationalité @fr
range: nationality
sub property of: personal property
definition: Describes a person's nationality. As with other cultural forms, an individual may have more than one property or descriptor of this type. For further information about this property, see nationality.

has nationality (self declared)
is replaced by: has nationality (self reported)
in dataset: The CWRC Ontology
comment: Deprecated in favour of instance has nationality (self reported).
comment: Désapprouver en faveur de l'instance de nationalité (autodéclarée). @fr
label: de nationalité (autodéclarée) @fr
range: nationality
sub property of: personal property (self reported)
deprecated: true
term status: deprecated

has nationality (self reported)
in dataset: The CWRC Ontology
type: ObjectProperty
label: de nationalité (autodéclarée) @fr
range: nationality
sub property of: personal property self-reported
definition: A subproperty of personal property (self-reported), this property indicates a person's self-defined nationality/ies and is neither the same as citizenship nor commensurate with the geographical region or territory in which a person resides. For more information on this property see nationality.
definition: Une sous-propriété de propriété personnelle autodéclarée, cette propriété indique la/les nationalité(s) autoproclamée(s) d’une personne, différant de la citoyenneté et n’étant pas proportionnelle à la zone géographique ou au territoire sur lequel elle réside. @fr

natively known language
in dataset: The CWRC Ontology
type: ObjectProperty
label: a une langue maternelle @fr
range: linguistic ability (spoken and/or writen)
sub property of: language known
definition: Knowledge of the language for writing or reading.

natively known language (self declared)
is replaced by: language known (self reported)
in dataset: The CWRC Ontology
comment: Deprecated in favour of instance language known (self reported).
comment: Désapprouver en faveur de l'instance connait la langue (autodéclaré). @fr
label: a une langue maternelle (autodéclaré) @fr
range: linguistic ability (spoken and/or writen)
sub property of: language known (self declared)
deprecated: true
term status: deprecated

natively known language (self reported)
in dataset: The CWRC Ontology
type: ObjectProperty
label: a une langue maternelle (autodéclaré) @fr
range: linguistic ability (spoken and/or writen)
sub property of: language known (self reported)

has Peformance
is replaced by: has Element
in dataset: The CWRC Ontology
type: DeprecatedProperty
comment: Deprecated in favour of property has Element.
comment: Désapprouver en faveur de la propriété a un élément. @fr
domain: Event
domain: performance
label: a une interprétation @fr
range: performance
deprecated: true
equivalent property: has Element
term status: deprecated
definition: Associates an event or performance to a performance.

has persona
in dataset: The CWRC Ontology
type: ObjectProperty
domain: natural person
range: persona
definition: Associates a persona with one more natural person(s).

has political affiliation
in dataset: The CWRC Ontology
type: ObjectProperty
range: political affiliation
sub property of: personal property
definition: Describes a person's political affiliation. As with other cultural forms, an individual may have more than one property or descriptor of this type. For further information about this property, see political affiliation.

has political affiliation (self reported)
in dataset: The CWRC Ontology
type: ObjectProperty
range: political affiliation
sub property of: personal property self-reported
definition: Describes a person's self-reported political affiliation. As with other cultural forms, an individual may have more than one property or descriptor of this type. For further information about this property, see political affiliation.

has race
in dataset: The CWRC Ontology
type: ObjectProperty
label: est de race @fr
range: race or colour
sub property of: personal property
definition: A subproperty of personal property, this describes a person's racial identity. For further information about this property, see race or colour.

has race (self declared)
is replaced by: has nationality (self reported)
in dataset: The CWRC Ontology
comment: Deprecated in favour of instance has nationality (self reported).
comment: Désapprouver en faveur de l'instance de nationalité (autodéclarée). @fr
label: est de race (autodéclarée) @fr
range: Race
sub property of: personal property (self reported)
deprecated: true
term status: deprecated
definition: This describes a person's self-reported racial identity.

race or colour self-defined
in dataset: The CWRC Ontology
type: ObjectProperty
label: race ou couleur autodéclarée @fr
range: race or colour
sub property of: personal property self-reported
definition: A subproperty of personal property self reported, this property indicates a person's self-reported race or colour. For further information about this property, see race or colour.
definition: Une sous-propriété de propriété personnelle autodéclarée, cette propriété indique l’appartenance raciale ou la couleur autodéclarées d’une personne. Pour plus d’informations à propre de cette propriété, voir race ou couleur. @fr

has religious affiliation
in dataset: The CWRC Ontology
type: ObjectProperty
label: est de confession @fr
range: religion
sub property of: personal property
definition: Describes a person's religion. As with other cultural forms, an individual may have more than one property or descriptor of this type. For further information about this property, see religion.

has religious affilication (self defined)
is replaced by: has religious affiliation (self reported)
in dataset: The CWRC Ontology
comment: Deprecated in favour of instance has religious affiliation (self reported).
comment: Désapprouver en faveur de l'instance religion (autodéclarée). @fr
label: religion (autodéclarée) @fr
range: religion
sub property of: personalPropertySelfDefined
deprecated: true
term status: deprecated

has religious affiliation (self reported)
in dataset: The CWRC Ontology
type: ObjectProperty
label: religion (autodéclarée) @fr
range: religion
sub property of: personal property self-reported
definition: A personal property, this indicates a person's self-reported religion(s) or belief system(s).
definition: Une propriété personnelle qui indique la/les religion(s) ou le(s) système(s) de croyance autoproclamé(s) par une personne. @fr

has Role
in dataset: The CWRC Ontology
type: ObjectProperty
domain: performance
label: a un rôle @fr
definition: Associates an event element to a role.

has sexual orientation
in dataset: The CWRC Ontology
type: ObjectProperty
label: a une orientation sexuelle @fr
range: sexuality
sub property of: personal property
definition: Describes a person's sexuality. As with other cultural forms, an individual may have more than one property or descriptor of this type. For further information about this property, see sexuality.

has sexual orientation (self declared)
is replaced by: has self-reported sexual orientation
in dataset: The CWRC Ontology
comment: Deprecated in favour of instance has self-reported sexual orientation.
comment: Désapprouver en faveur de l'instance a une orientation sexuelle autodéclarée. @fr
label: a une orientation sexuelle (autodéclarée) @fr
range: sexuality
sub property of: personal property (self reported)
deprecated: true
term status: deprecated

has self-reported sexual orientation
in dataset: The CWRC Ontology
type: ObjectProperty
label: a une orientation sexuelle autodéclarée @fr
range: sexuality
sub property of: personal property self-reported
definition: A subproperty of Personal Property Self-reported, this describes a person's self-reported sexuality. For more information, see sexuality and sexuality context.
definition: Une sous-propriété de propriété personnelle autodéclarée qui décrit la sexualité autodéclarée d’une personne. Pour plus d’information, voir sexualité et sexualité en contexte. @fr

has social class
in dataset: The CWRC Ontology
type: ObjectProperty
label: de classe sociale @fr
range: social class
sub property of: personal property
definition: Describes a person's social class. As with other cultural forms, an individual may have more than one property or descriptor of this type. For further information about this property, see social class.

has social class (self defined)
is replaced by: has social class (self reported)
in dataset: The CWRC Ontology
comment: Deprecated in favour of instance has social class (self reported).
comment: Désapprouver en faveur de l'instance de classe sociale (autodéclarés). @fr
label: de classe sociale (autodéclarés) @fr
range: social class
sub property of: personalPropertySelfDefined
deprecated: true
term status: deprecated

has social class (self reported)
in dataset: The CWRC Ontology
type: ObjectProperty
label: de classe sociale (autodéclarés) @fr
range: social class
sub property of: personal property self-reported
definition: A subproperty of Personal Property Self-Reported indicating a person's self-reported social class.
definition: Une sous-propriété de propriété personnelle autodéclarée qui indique la classe sociale autodéclarée d’une personne. @fr

has Student
in dataset: The CWRC Ontology
type: ObjectProperty
domain: School
range: natural person
definition: Indicates attending or having attended for education either a particular school or a particular type of schooling.

has Sub Element
in dataset: The CWRC Ontology
type: ObjectProperty
domain: Event
label: a un sous évènement @fr
range: Event
definition: Associates a sub event to a master event.

HETEROSEXUAL
in dataset: The CWRC Ontology
type: sexuality
type: Concept
value: HETEROSEXUALITY
label: heterosexuality
label: hétérosexualité @fr
definition: Heterosexuality indicates sexual attraction to the so-called "opposite sex," that is, sexual attraction between men and women. This understanding relies, like bisexual, on a binary understanding of sex and gender that also often conflates sex with gender. Adrienne Rich draws on Kathleen Gough in articulating an understanding of heterosexuality as compulsory for women within patriarchy. In her essay "The Straight Mind" (first published in 1980) Monique Wittig understands heterosexuality as a semiotic, linguistic, political, and ontological construct. It constitutes itself as a normative system through the oppression of women by men and the "necessity of the different/other at every level". The straight mind "creates the doctrine of the difference between sexes to justify this oppression".
definition: L’hétérosexualité indique l’attraction sexuelle pour le sexe prétendument «opposé», c’est-à-dire entre les hommes et les femmes. Cette compréhension du terme repose, comme pour la bisexualité, sur une interprétation binaire du sexe et du genre, qui confond habituellement les deux notions. S’appuyant sur Kathleen Gough, Adrienne Rich interprète ll’hétérosexualité comme obligatoire pour les femmes dans un contexte patriarcal. Dans son article «La pensée straight» (publiée pour la première fois en 1980) Monique Wittig interprète l’hétérosexualité comme une construction sémiotique, linguistique, politique et ontologique. Elle se constitue comme un système normatif qui passe par l'oppression des femmes par les hommes et la «la nécessité de l'autre différent à tous les niveaux». La pensée straight «produit la doctrine de la différence entre les sexes pour justifier cette oppression». @fr
in scheme: sexuality
name: heterosexual (sexual identity)

Hinduism
in dataset: The CWRC Ontology
type: religion
type: Concept
comment: La description de ce terme est basée sur celle de DBPedia. @fr
comment: The description for this term is indebted to the Getty Art & Architecture Thesaurus.
label: Hindoeïsme @nl
label: Hindou @fr
label: Hinduismo @es
label: hindouisme @fr
label: yin du jiao @zh-latn
label: yin tu chiao @zh-latn
label: yìn dù jiào @zh-latn
label: 印度教 @zh-hant
definition: "General term for the set of intellectual and philosophical tenets and highly diverse beliefs and practices that define the civilization, art, literature, society, and politics of the Indian subcontinent. Hinduism is not a common set of rigid beliefs, but varies significantly between different regions; it includes Shaivism, Vaishnavism, Srauta, and numerous other traditions. Among other practices and philosophies, Hinduism includes a wide spectrum of laws and prescriptions of "daily morality" based on karma, dharma, and societal norms. The highest divine powers are seen as complementary to one another and not exclusive. Hinduism does not have a particular founder or central authority. Hindu literature is rich and varied, with no one text considered uniquely authoritative. The Vedas, dating to the Vedic period (ca. 1200-500 BCE), are the earliest extant writings. Religious law books and epics such as the Ramayana and the Mahabharata have been and continue to be highly influential." (Getty, 2017)
definition: "L’hindouisme (hindi : hindu dharm ; devanāgarī : हिन्दू धर्म ; «religion hindoue»), ou Sanatana Dharma (sanskrit IAST : sanātanadharma ; devanāgarī : सनातनधर्म ; «Loi Éternelle»), est l'une des plus vieilles religions du monde encore pratiquées, qui n'a ni fondateur ni Église. Avec près d'un milliard de fidèles dans 84 pays, c'est actuellement la troisième religion la plus pratiquée dans le monde après le christianisme et l'islam. Elle est issue du sous-continent indien qui reste son principal foyer de peuplement. La particularité de l'hindouisme est de n'avoir ni prophètes ni dogmes centraux. Cependant, les hindous contemporains croient en l'autorité du Veda, qui, selon la tradition, fut révélé aux hommes, grâce à la «vision» des Rishi. Le terme persan hindu (du sanskrit Sindhu) désignait au départ, pour les musulmans qui pénétrèrent en Inde, les habitants du bassin de l'Indus. L'hindouisme se présente comme un ensemble de concepts philosophiques issus d'une tradition remontant à la protohistoire indienne, la pratique hindouiste étant sans doute issue d'une tradition orale très ancienne, proche de l'animisme. On retient parfois une tripartition historique qui fait de l'hindouisme la dernière phase du développement des religions en Inde, après le védisme aryen (~1500 à 900 av. J.-C.) et le brahmanisme (~900 à 400 av. J.-C.). Au-delà du syncrétisme théologique, l'hindouisme d'avant les invasions islamiques et le colonialisme européen qui soumirent l'Inde à leur autorité était un vecteur pour toutes les sciences : le droit, la politique, l'architecture, l'astronomie, la philosophie, la médecine, etc., comme d'autres savoirs qui avaient en commun le substrat religieux." (DBpedia, 2017) @fr
definition: "Se refiere al conjunto de creencias y prácticas altamente diversas que generalmente denotan la civilización y cultura India de los dos mil últimos años. La religión influye fuertemente en el arte, la literatura, la política y al sociedad hinduista. Presenta la creencia y la práctica de ritos mágicos, cultos animales, creencia en demonios, cultos a deidades, incluyendo dioses locales y dioses centrales, misticismo, ascetismo y una apreciación y respeto por otras formas de cultos o creencias religiosas. La verdad de la religión no esta concebida como un término dogmático, sino que la verdad supera toda definición verbal. En vez de un sistema de doctrinas, el énfasis se pone en la manera correcta de vivir (dharma). Hay variaciones significativas entre diversas regiones. La mayoría de las formas de hinduismo enfatizan el concepto del reencarnación o de la transmigración; la liberación (moksha) desde el ciclo del samsara es la última meta espiritual del hindú. Brahma, Vishnu y Shiva son las deidades hindúes principales, juntos forman la tríada, el Trimurti. Existen muchos otros deidades de menor rango. El Hinduismo no tiene un fundador en particular o un iniciado, allí no hay una autoridad central. La literatura hindú es rica y variada, sin un texto considerado únicamente autoritario. El Vedas, fechando en el período de Vedic (ca. 1200-500 a. C), es la escritura más temprana existente. Los libros de ley y las epopeyas religiosas tales como el Ramayana y el Mahabharata han sido y continúan siendo altamente influyentes." (Getty, 2017) @es
definition: "Verwijst naar de reeks uiterst diverse geloven en gebruiken die in het algemeen verwijzen naar de Indiase beschaving en cultuur van de afgelopen tweeduizend jaar. De religie heeft een sterke invloed op de Indiase kunst, literatuur, maatschappij en politiek. Het hindoeïsme omvat diverse religieuze geloven en gebruiken en in plaats van andere goden, andere godsdiensten en andere religieuze concepten als fout of onverenigbaar te zien, worden de hoogste goddelijke machten gezien als elkaar aanvullend. De religieuze waarheid wordt niet gezien in dogmatische termen aangezien wordt geloofd dat de waarheid alle woordelijke definities overstijgt. In plaats van op een reeks doctrines ligt de nadruk op de juiste manier van leven (dharma). Er zijn aanzienlijke verschillen per regio. In de meeste vormen van het hindoeïsme ligt de nadruk op het concept van reïncarnatie of zielsverhuizing; de bevrijding (moksha) van de cyclus van samsara is het uiteindelijke spirituele doel van hindoes. Brahma, Visjnoe en Shiva zijn de belangrijkste hindoeïstische godheden en vormen gezamenlijk een drie-eenheid, de Trimurti. Verder is er een groot aantal lagere goden. Het hindoeïsme heeft geen specifieke oprichter of ontstaansmoment en er is geen centrale autoriteit. De hindoeïstische literatuur is erg rijk en gevarieerd en geen enkele specifieke tekst wordt als gezaghebbend beschouwd. De Veda's, die afkomstig zijn uit de Vedische periode (ca. 1200-500 v. Chr.), zijn de oudste overgebleven geschriften. Religieuze wetboeken en heldendichten zoals de Ramayana en de Mahabharata zijn altijd erg invloedrijk geweest." (Getty, 2017) @nl
definition: "代表過去兩千年來印度文明與文化的一套極多樣的信仰與實踐方式。此宗教對印度藝術、文學、社會與政治有極大影響。印度教包含多元的宗教信仰及實踐方式，因此不會認為其他的神明、其他形式的敬拜及宗教觀是錯誤或者互不相容，反而認為最高的神力是彼此互補的。他們相信真理超越所有言語定義，因此不應武斷認定何謂宗教真理。重視生活的正確方式(法)，而非一連串的教條。不同宗教之間差異甚鉅。大部分的印度教形式強調輪迴觀念；從生死疾苦等輪迴中解脫是印度教徒最終的心靈目標。婆羅摩、毗濕奴、濕婆是印度教主要的三個神明(三相神) 。還有很多其他小神。印度教沒有確切的建立者及開始時間，也沒有中央權威。印度教文學豐富且多樣，但沒有哪一部作品被認為是權威。追溯自吠陀時期(西元前500年到西元1200年)的吠陀經是現存最早的經典。宗教法律典籍及史詩如《羅摩耶那史詩》及《摩訶婆羅達》仍舊極具影響力。" (Getty, 2017) @zh-hant
in scheme: religion

HOMOSEXUAL
in dataset: The CWRC Ontology
type: sexuality
type: Concept
value: HOMOSEXUALITY
value: MALE HOMOSEXUAL
label: homosexuality
label: homosexualité @fr
definition: Homosexuality indicates sexual attraction to subjects of the same gender. Like bisexual, it draws on a binary understanding of sex and gender that also often conflates sex with gender. Homosexual is often used as an umbrella term for lesbian and gay sexuality.
definition: L’homosexualité indique l’attraction sexuelle entre des sujets du même genre. Comme bisexuel, le terme repose sur une interprétation binaire et souvent indifférenciée du sexe et du genre. Homosexuel est souvent utilisé comme terme générique pour les sexualités lesbienne et gay. @fr
in scheme: sexuality
name: homosexual (sexual identity)

housing activism
in dataset: The CWRC Ontology
type: political affiliation
type: Concept
value: housing charity
comment: The description for this term is indebted to DBpedia.
label: housing movement
label: mouvement pour le droit au logement @fr
broader transitive: progressivism
definition: Advocacy or activism related to housing for the poor or otherwise disadvantaged.
definition: Militantisme et lutte en faveur du droit au logement pour les plus démunis et autres personnes défavorisées. Voir Droit au logement — Wikipédia @fr
in scheme: political affiliation
related: civil rights

human rights activist
in dataset: The CWRC Ontology
type: political affiliation
type: Concept
value: humanitarian
comment: The description for this term is indebted to DBpedia.
label: droits de l'homme @fr
label: human rights
definition: Advocacy or activism in support of human rights. Human rights - Wikipedia
definition: Militantisme et lutte en faveur des droits humains. Voir Droits de l'homme — Wikipédia @fr
in scheme: political affiliation

humanist
in dataset: The CWRC Ontology
type: political affiliation
type: Concept
comment: La description de ce terme est basée sur celle de DBPedia. @fr
comment: The description for this term is indebted to DBpedia.
label: Humanisme @fr
label: humanism
definition: "Humanism is a philosophical and ethical stance that emphasises the value and agency of human beings, individually and collectively, and generally prefers critical thinking and evidence (rationalism, empiricism) over acceptance of dogma or superstition. The meaning of the term humanism has fluctuated according to the successive intellectual movements which have identified with it. The term was coined by theologian Friedrich Niethammer at the beginning of the 19th century. Generally, however, humanism refers to a perspective that affirms some notion of human freedom and progress. In modern times, humanist movements are typically aligned with secularism, and today humanism typically refers to a non-theistic life stance centred on human agency and looking to science rather than revelation from a supernatural source to understand the world." (DBpedia, 2017)
definition: "L’humanisme est un courant culturel européen, trouvant ses origines en Italie, principalement autour de la Toscane, qui s'est développé à la Renaissance. Renouant avec la civilisation gréco-romaine, les intellectuels de l'époque manifestent un vif appétit de savoir (philologie notamment). Considérant que l’Homme est en possession de capacités intellectuelles potentiellement illimitées, ils considèrent la quête du savoir et la maîtrise des diverses disciplines comme nécessaires au bon usage de ces facultés. Ils prônent la vulgarisation de tous les savoirs, dont religieux ; la parole divine doit être accessible à toute personne, quelles que soient ses origines ou sa langue (traduction de la Bible par Jacques Lefèvre d'Étaples en 1523). Ainsi, cet humanisme vise à diffuser plus clairement le patrimoine culturel. L’individu, correctement instruit, reste libre et pleinement responsable de ses actes dans la croyance de son choix. Les notions de liberté ou libre arbitre, de tolérance, d’indépendance, d’ouverture et de curiosité sont, de ce fait, indissociables de la théorie humaniste classique. Par extension, on désigne par «humaniste» toute pensée qui met au premier plan de ses préoccupations le développement des qualités essentielles de l'être humain. Une vaste catégorie de philosophies portant sur l'éthique affirme la dignité et la valeur de tous les individus, fondée sur la capacité de déterminer le bien et le mal par le recours à des qualités humaines universelles, en particulier la rationalité. L'humanisme implique un engagement à la recherche de la vérité et de la moralité par l'intermédiaire des moyens humains, en particulier les sciences, en solidarité avec l'humanité. En mettant l'accent sur la capacité d'auto-détermination, l'humanisme rejette la validité des justifications transcendantes de l'époque, alors éloignée des questions phénoménologiques du XXe siècle, jugées comme une dépendance à l'égard du surnaturel et de la croyance, tels certains textes présenté… @fr
in scheme: political affiliation

HUSBAND
in dataset: The CWRC Ontology
type: ObjectProperty
label: husband of
label: mari de @fr
sub property of: PARTNER
different from: Partnership

identity
in dataset: The CWRC Ontology
type: DeprecatedProperty
type: Concept
comment: Deprecated from previous Orlando Ontology design.
comment: Désapprouver de l'ancienne ontology Orlando. @fr
domain: actor
range: Person
term status: deprecated
definition: The identity of the person who committed the act.

colonialist
in dataset: The CWRC Ontology
type: political affiliation
type: Concept
value: commonwealth supporter
value: imperialist
comment: La description de ce terme est basée sur celle de DBPedia. @fr
comment: The description for this term is indebted to DBpedia.
label: Impérialisme @fr
label: imperialism
definition: "Imperialism means "to extend a country's power through military and diplomacy". Its name originated from the Latin word imperium, which means to rule over large territories. Imperialism is "a policy of extending a country's power and influence through colonization, use of military force, or other means". It has also allowed for the rapid spread of technologies and ideas. The term imperialism has been applied to Western (and Japanese) political and economic dominance especially in Asia and Africa in the 19th and 20th centuries. Its precise meaning continues to be debated by scholars. Some writers, such as Edward Said, use the term more broadly to describe any system of domination and subordination organised with an imperial center and a periphery. Imperialism is defined as "A policy of extending a country’s power and influence through diplomacy or military force." Imperialism is particularly focused on the control that one group, often a state power, has on another group of people. This is often through various forms of "othering" (see other) based on racial, religious, or cultural stereotypes. There are "formal" or "informal" imperialisms. "Formal imperialism" is defined as "physical control or full-fledged colonial rule". "Informal imperialism" is less direct; however, it is still a powerful form of dominance. The definition of imperialism has not been finalized for centuries and was confusedly seen to represent the policies of major powers, or simply, general-purpose aggressiveness. Further on, some writers used the term imperialism, in slightly more discriminating fashion, to mean all kinds of domination or control by a group of people over another. To clear out this confusion about the definition of imperialism one could speak of "formal" and "informal" imperialism, the first meaning physical control or "full-fledged colonial rule" while the second implied less direct rule though still containing perceivable kinds of dominance. Informal rule is generally less c…
definition: "L'impérialisme est une stratégie ou une doctrine politique de conquête, visant la formation d'un empire ou d'une domination. Pour John Atkinson Hobson, la nouveauté dans l'impérialisme de la fin du XIXe siècle et du début du XXe siècle, c'est qu'il n'est plus lié à l'idée d'un empire couvrant le monde connu, comme c'était le cas dans le cadre de la Pax Romana. Au contraire, à la suite de la montée du nationalisme au XIXe siècle, cet impérialisme donne lieu à une lutte entre empires concurrents (Empire allemand, Empire britannique, Empire russe, etc.). Au niveau économique, l'impérialisme est alors de nature protectionniste et s'oppose au libre-échange. Par ailleurs, ses liens avec certaines formes de capitalisme monopolistique sont mis en avant par de nombreux auteurs marxistes. De nos jours, ce terme est employé de façon large pour désigner tout rapport de domination établi par une nation ou pays sur un ou plusieurs autres pays." (DBpedia, 2017) @fr
in scheme: political affiliation

in role
in dataset: The CWRC Ontology
type: DeprecatedProperty
type: Concept
comment: Deprecated from previous Orlando Ontology design.
comment: Désapprouver de l'ancienne ontologie Orlando. @fr
domain: actor
range: role
term status: deprecated
definition: The role taken on by this actor.

indian nationalist
in dataset: The CWRC Ontology
type: political affiliation
type: Concept
value: pro-independence (indian)
comment: La description de ce terme est basée sur celle de DBPedia. @fr
comment: The description for this term is indebted to DBpedia.
label: Indian independence movement
label: Mouvement pour l'indépendance de l'Inde @fr
broader transitive: human rights activist
definition: "45xCe modèle est-il pertinent ? Cliquez pour en voir d'autres.Cet article ne cite pas suffisamment ses sources (mai 2015). Si vous disposez d'ouvrages ou d'articles de référence ou si vous connaissez des sites web de qualité traitant du thème abordé ici, merci de compléter l'article en donnant les références utiles à sa vérifiabilité et en les liant à la section «Notes et références» (modifier l'article, comment ajouter mes sources ?). Le mouvement pour l'indépendance de l'Inde recouvre un ensemble complexe englobant diverses campagnes nationales et régionales, des troubles et des tentatives inspirés d'une philosophie à la fois non-violente et militante, et a impliqué une gamme étendue d'organismes, de philosophies et de mouvements politiques indiens ayant eu pour but commun de mettre fin à l'autorité coloniale britannique aussi bien que celle d'autres administrations coloniales dans le sous-continent indien." (DBpedia, 2017) @fr
definition: "The Indian Independence Movement encompassed activities and ideas aiming to end the East India Company rule (1757–1858) and the British Raj (1858–1947) in the Indian subcontinent. The Movement spanned a total of 190 years (1757-1947). The very first organised militant movements were in Bengal, but they later took movement in the then newly formed Indian National Congress with prominent moderate leaders seeking only their basic right to appear for Indian Civil Service examinations, as well as more rights, economic in nature, for the people of the soil. The early part of the 20th century saw a more radical approach towards political self-rule proposed by leaders such as the Lal, Bal, Pal and Aurobindo Ghosh, V. O. Chidambaram Pillai. The last stages of the self-rule struggle from the 1920s onwards saw Congress adopt Mohandas Karamchand Gandhi's policy of nonviolence and civil resistance, Muhammad Ali Jinnah's constitutional struggle for the rights of minorities in India, and several other campaigns. Activists Netaji Subhas Chandra Bose and Bhagat Singh preached armed revolution to achieve self-rule. Poets and writers such as Rabindranath Tagore, Subramaniya Bharathi, Allama Iqbal, Josh Malihabadi, Mohammad Ali Jouhar, Bankim Chandra Chattopadhyay, and Kazi Nazrul Islam used literature, poetry, and speech as a tool for political awareness. Feminists such as Sarojini Naidu and Begum Rokeya promoted the emancipation of Indian women and their participation in national politics. Babasaheb Ambedkar championed the cause of the disadvantaged sections of Indian society within the larger self-rule movement. The period of the Second World War saw the peak of the campaigns by the Quit India movement led by Mahatma Gandhi and the Indian National Army movement led by Netaji Subhas Chandra Bose. The Indian self-rule movement was a mass-based movement that encompassed various sections of society. It also underwent a process of constant ideological evolution. Although the basic ideol…
in scheme: political affiliation
related: civil rights
related: progressivism

Indigenous rights movement
in dataset: The CWRC Ontology
type: political affiliation
type: Concept
comment: The description for this term is indebted to DBpedia.
label: droit des peuples autochtones @fr
broader transitive: civil rights
definition: Advocacy or activism in support of human rights. Indigenous rights - Wikipedia
definition: Militantisme et lutte en faveur des droits des peuples autochtones. Voir Droit des peuples autochtones — Wikipédia @fr
in scheme: political affiliation
related: anti-colonial
related: human rights activist

indigent
in dataset: The CWRC Ontology
type: social class
type: Concept
label: indigente @fr
definition: Cette classe sociale inclut «les pauvres, les indigents/tes, les chômeurs/euses» soutenus/es par les actions de charité ou les aides sociales. @fr
definition: This social class is "poor, destitute, unemployed," supported by charity, or on social security. (brown_orlando, 2006)
in scheme: social class

individualist
in dataset: The CWRC Ontology
type: political affiliation
type: Concept
comment: La description de ce terme est basée sur celle de DBPedia. @fr
comment: The description for this term is indebted to DBpedia.
label: Individualisme @fr
label: individualism
definition: "Individualism is the moral stance, political philosophy, ideology, or social outlook that emphasises the moral worth of the individual. Individualists promote the exercise of one's goals and desires and so value independence and self-reliance and advocate that interests of the individual should achieve precedence over the state or a social group, while opposing external interference upon one's own interests by society or institutions such as the government. Individualism is often defined in contrast to totalitarianism, collectivism and more corporate social forms. Individualism makes the individual its focus and so starts "with the fundamental premise that the human individual is of primary importance in the struggle for liberation." Classical Liberalism, existentialism, and anarchism are examples of movements that take the human individual as a central unit of analysis. Individualism thus involves "the right of the individual to freedom and self-realization". It has also been used as a term denoting "The quality of being an individual; individuality" related to possessing "An individual characteristic; a quirk." Individualism is thus also associated with artistic and bohemian interests and lifestyles where there is a tendency towards self-creation and experimentation as opposed to tradition or popular mass opinions and behaviors as so also with humanist philosophical positions and ethics." (DBpedia, 2017)
definition: "L'individualisme est une conception philosophique, politique, sociale et morale qui tend à privilégier les droits, les intérêts et la valeur de l'individu par rapport à ceux du groupe. Il prône l'autonomie individuelle face aux diverses institutions sociales et politiques (la famille, le clan, la corporation, la caste...) qui exercent sur lui de multiples pressions. Il ne faut pas confondre individualisme et égoïsme. Contrairement à la compréhension populaire, ce n'est que péjorativement que l'individualisme peut se rapprocher de l'égoïsme et se définir comme une tendance à ne vivre que pour soi. L'individualisme est apparu vers la fin du Moyen Âge et s'est développé à partir de la Renaissance sous l'effet de multiples facteurs, tels que l'invention de l'imprimerie au XVe siècle, qui a favorisé l'activité individuelle de la lecture." (DBpedia, 2017) @fr
in scheme: political affiliation

internationalist
in dataset: The CWRC Ontology
type: political affiliation
type: Concept
comment: La description de ce terme est basée sur celle de DBPedia. @fr
comment: The description for this term is indebted to DBpedia.
label: Internationalisme institutionnel @fr
label: internationalism
definition: "Internationalism is a political principle which advocates a greater political or economic cooperation among nations and peoples, and whose ideological roots can be traced to both socialism and liberalism. Supporters of this principle are referred to as internationalists, and generally believe that the people of the world should unite across national, political, cultural, racial, or class boundaries to advance their common interests, or that the governments of the world should cooperate because their mutual long-term interests are of greater importance than their short-term disputes. Internationalism is, in general, opposed to nationalism, jingoism or chauvinism, and war, and proponents can include supporters of any of the four socialist Internationals and organisations such as the United Nations or the World Federalist Movement." (DBpedia, 2017)
definition: "L’internationalisme institutionnel est un concept de la théorie des relations internationales, désignant un supranationalisme qui prône le développement de la coopération institutionnelle entre États-nations." (DBpedia, 2017) @fr
in scheme: political affiliation

OTHER
in dataset: The CWRC Ontology
type: ObjectProperty
label: interpersonal relationship
label: relation interpersonnelle @fr

Irish
in dataset: The CWRC Ontology
type: ethnicity
type: Concept
label: Irlandais @fr
definition: "The Irish people (Irish: Muintir na hÉireann or Na hÉireannaigh) are a nation and ethnic group native to the island of Ireland, who share a common Irish ancestry, identity and culture. Ireland has been inhabited for about 9,000 years according to archaeological studies (see Prehistoric Ireland). For most of Ireland's recorded history, the Irish have been primarily a Gaelic people (see Gaelic Ireland). Anglo-Normans conquered parts of Ireland in the 12th century, while England's 16th/17th century (re)conquest and colonization of Ireland brought a large number of English and Lowland Scots to parts of the island, especially the north. Today, Ireland is made up of the Republic of Ireland (an independent state), and the smaller Northern Ireland (a part of the United Kingdom)." (DBpedia, 2017)
definition: «Le peuple irlandais (en irlandais : Muintir na hÉireann, na hÉireannaigh ou na Gaeil) est un groupe ethnique d'Europe de l'Ouest originaire d'Irlande, une île de l'archipel des îles Britanniques. Les personnes d'appartenance ethnique irlandaise, vivant en dehors de ce pays, sont communes dans beaucoup de pays du monde occidental, particulièrement dans les pays anglophones. D'ailleurs, ce sont les États-Unis qui accueillent le plus grand nombre de personnes d'ascendance irlandaise avec environ la moitié de la population irlandaise mondiale, c'est-à-dire dix fois plus qu'en Irlande elle-même. Néanmoins, ce n'est qu'en République d'Irlande et en Irlande du Nord qu'ils forment la majorité de la population. À l'étranger, la langue Celte Irlandaise n'est pratiquement pas parlée, et cette langue s'efface surtout au profit de l'Anglais, en Amérique du Nord et en Océanie.» (DBpedia, 2017) @fr
in scheme: ethnicity

home ruler
in dataset: The CWRC Ontology
contrary to: anti-home rule
type: political affiliation
type: Concept
value: home ruler (ireland)
value: irish home ruler
comment: The description for this term is indebted to DBpedia.
label: Irish Home Rule Movement
label: mouvement Irish Home Rule @fr
broader transitive: republicanism
definition: "The Irish Home Rule movement was a movement that agitated for self-government for Ireland within the United Kingdom of Great Britain and Ireland. It was the dominant political movement of Irish nationalism from 1870 to the end of World War I. Isaac Butt founded the Home Government Association in 1870. This was succeeded in 1873 by the Home Rule League, and in 1882 by the Irish Parliamentary Party. These organisations campaigned for home rule in the British House of Commons. Under the leadership of Charles Stewart Parnell, the movement came close to success when the Liberal government under William Ewart Gladstone introduced the First Home Rule Bill in 1886, but the bill was defeated in the House of Commons after a split in the Liberal Party. After Parnell's death, Gladstone introduced the Second Home Rule Bill in 1893; it passed the Commons but was defeated in the House of Lords. After the removal of the Lords' veto in 1911, the Third Home Rule Bill was introduced in 1912, leading to the Home Rule Crisis. On the outbreak of World War I it was enacted, but suspended until the conclusion of the war. Following the Easter Rising of 1916, public support shifted from the Home Rule movement to the more radical Sinn Féin party. In the 1918 General Election the Irish Parliamentary Party suffered a crushing defeat, only a handful of MP's surviving. This was effectively the death of the Home Rule movement. The elected Sinn Féin MPs had no interest in home rule, instead setting up their own legislature, Dáil Éireann, and declaring the independence of Ireland as a republic. Britain passed a Fourth Home Rule Bill, the Government of Ireland Act 1920, aimed at creating separate parliaments for Northern Ireland and Southern Ireland. The former was established in 1921, and the state continues to this day, but the latter never functioned. Following the Treaty that ended the Anglo-Irish War, the 26 southern counties of Ireland gained independence as the Irish Free State." (DBpedia, 20…
in scheme: political affiliation
related: cultural nationalist
related: anti-unionist

cultural nationalist
in dataset: The CWRC Ontology
type: political affiliation
type: Concept
value: irish nationalist
value: irish patriotism
value: parnellite
comment: La description de ce terme est basée sur celle de DBPedia. @fr
comment: The description for this term is indebted to DBpedia.
label: Irish nationalism
label: Nationalisme irlandais @fr
broader transitive: nationalism
definition: "Irish nationalism asserts that the Irish people are a nation. Since the partition of Ireland, the term generally refers to support for a united Ireland. Irish nationalists assert that rule from London has been to the detriment of Irish interests." (DBpedia, 2017)
definition: "Le nationalisme irlandais est né avec l'occupation précoce de l'île par les Anglais. Le nationalisme culturel irlandais vise à rétablir la culture gaélique des Irlandais en combattant, notamment, l'impérialisme culturel anglais. Il s'oppose historiquement aux privilèges accordés à l'aristocratie protestante, qui imposait le serment du test et interdisait aux catholiques de siéger au parlement." (DBpedia, 2017) @fr
in scheme: political affiliation
related: anti-unionist

anti-unionist
in dataset: The CWRC Ontology
type: political affiliation
type: Concept
value: irish independence
value: irish republic
value: irish republican
value: irish republicanism
value: irish resistance
comment: La description de ce terme est basée sur celle de DBPedia. @fr
comment: The description for this term is indebted to DBpedia.
label: Irish republicanism
label: Républicanisme irlandais @fr
broader transitive: republicanism
definition: "Irish republicanism (Irish: poblachtánachas Éireannach) is an ideology based on the belief that all of Ireland should be an independent republic. The development of nationalist and democratic sentiment throughout Europe in the eighteenth and nineteenth centuries was reflected in Ireland in the emergence of republicanism, in opposition to British rule. This followed hundreds of years of British conquest and Irish resistance through rebellion. Discrimination against Catholics and Non-conformists, attempts by the British administration to suppress Irish culture, and the belief that Ireland was economically disadvantaged as a result of the Act of Union were among the specific factors leading to such opposition. The Society of United Irishmen, formed in the 1780s and led primarily by liberal Protestants, evolved into a revolutionary republican organisation, inspired by the American Revolution and allied with Revolutionary France. It launched the 1798 Rebellion with the help of French troops. The rebellion had some success, especially in County Wexford, before it was suppressed. A second rising in 1803, led by Robert Emmet, was quickly put down, and Emmet was hanged. The Young Ireland movement, formed in the 1830s, was initially a part of the Repeal Association of Daniel O'Connell, but broke with O'Connell on the issue of the legitimacy of the use of violence. Primarily a political and cultural organisation, some members of Young Ireland staged an abortive rising, the Young Irelander Rebellion of 1848. Its leaders were transported to Van Diemen's Land. Some of these escaped to the United States, where they linked up with other Irish exiles to form the Fenian Brotherhood. Together with the Irish Republican Brotherhood, founded in Ireland by James Stephens and others in 1858, they made up a movement commonly known as "Fenians" which was dedicated to the overthrow of British imperial rule in Ireland. They staged another rising, the Fenian Rising, in 1867, and a dynamite cam…
definition: "Le républicanisme irlandais est une idéologie politique opposée à la présence britannique en Irlande et prônant l'unification de l'île en une République égalitariste. Le fondateur du républicanisme irlandais est le protestant Theobald Wolfe Tone et son mouvement, les United Irishmen. À la fin du XVIIIe siècle, cette idée est portée à la fois par la bourgeoisie libérale protestante d'Irlande et par la paysannerie catholique. Après l'échec de la rébellion irlandaise de 1798, la bourgeoisie protestante devint réactionnaire et se rangea du côté anglais. Révolutionnaires et égalitaristes, inspirés par les révolutions française et américaine, les républicains irlandais se veulent aussi confessionnels, mythifiant l'ancienne union entre catholiques et protestants, sentiment symbolisé par le drapeau irlandais, union du vert des Irlandais et de l'orange des Orangistes. L'action armée tient une place importante dans la tradition républicaine irlandaise, son histoire s'émaillant de soulèvements et de groupes armés clandestins." (DBpedia, 2017) @fr
in scheme: political affiliation
related: cultural nationalist

anti-home rule
in dataset: The CWRC Ontology
type: political affiliation
type: Concept
value: anti-home ruler
value: anti-irish
value: anti-irish nationalist
value: unionist
comment: La description de ce terme est basée sur celle de DBPedia. @fr
comment: The description for this term is indebted to DBpedia.
label: Irish unionism
label: Unionisme en Irlande @fr
definition: " Pour les articles homonymes, voir unionisme. L'unionisme en Irlande est une idéologie politique prônant le maintien d'une forme d'union politique entre la province d'Irlande du Nord et le Royaume-Uni." (DBpedia, 2017) @fr
definition: "Unionism in Ireland is a political ideology that favours the continuation of some form of political union between the islands of Ireland and Great Britain. Since the partition of Ireland, unionism in Ireland has focused on maintaining and preserving the place of Northern Ireland within the United Kingdom. In this context, a distinction may be made between the unionism in the province of Ulster and unionism elsewhere in Ireland. Today in Northern Ireland, Unionist ideology is expressed in a number of different ways: through preferences for particular newspapers or sports team, participation in unionist culture and by voting for political candidates who espouse unionism. Irish nationalism is opposed to the ideology of unionism. Most unionists come from Protestant backgrounds; most nationalists come from a Roman Catholic background. Exceptions to these generalisations exist; there are Protestant nationalists and there are Catholic unionists." (DBpedia, 2017)
in scheme: political affiliation
related: cultural nationalist
related: anti-unionist

Islamism
in dataset: The CWRC Ontology
type: religion
type: Concept
comment: La description de ce terme est basée sur celle de DBPedia. @fr
comment: The description for this term is indebted to the Getty Art & Architecture Thesaurus.
label: Islam @es
label: Islamismo @es
label: Mahométisme @fr
label: Religion Mahométane @fr
label: i ssu lan chiao @zh-latn
label: islam @fr
label: yi si lan jiao @zh-latn
label: yī sī lán jiāo @zh-latn
label: 伊斯蘭教 @zh-hant
label: 回教 @zh-hant
broader transitive: Abrahamic religions
definition: "L'islam (arabe : الإسلام) est une religion abrahamique s'appuyant sur le dogme du monothéisme absolu (l'adoration du Dieu unique sans lui attribuer aucun associé) et prenant sa source dans le Coran, considéré comme le recueil de la parole de Dieu (arabe : الله, Allah) révélée à Mahomet, proclamé par les adhérents de l'islam comme étant le dernier prophète de Dieu, au VIIe siècle en Arabie. Un adepte de l'islam est appelé un musulman. L'islam revendique pour fondement et enseignement principal le tawhid (monothéisme, unicité et indivisibilité), c'est-à-dire le monothéisme le plus épuré où le culte est voué exclusivement à Dieu, sans lui attribuer aucun fils. Les musulmans croient que Dieu est un et incomparable et que le but de l'existence est d'adorer Dieu. Les musulmans croient également que l'islam est la version complète et universelle d'une foi primordiale qui a été révélée à plusieurs reprises par le passé à travers les prophètes, incluant Adam, Noé, Abraham, Moïse et Jésus. Ainsi, elle se présente comme un retour sur les pas d'Abraham (appelé, en arabe, Ibrahim par les musulmans) du point de vue de la croyance, le Coran le définissant comme étant l'étalon-pied, la lieue de la Kaaba, le mille d'Abraham (milla ta Ibrahim), c'est-à-dire une soumission exclusive à la volonté d'Allah. Le Coran reconnaît l'origine divine de l'ensemble des livres sacrés du judaïsme et du christianisme, tout en estimant qu'ils seraient, dans leurs interprétations actuelles, le résultat d'une falsification partielle : le Suhuf-i-Ibrahim (les Feuillets d'Abraham), la Tawrat (le Pentateuque ou la Torah), le Zabur de David et Salomon (identifié au Livre des Psaumes) et l'Injil (l'Évangile). Outre le Coran, la majorité des musulmans se réfèrent à des transmissions de paroles, actes et approbations de Mahomet, récits appelés hadîths, pour l'établissement de règles juridiques (fiqh) permettant la compréhension et l'accomplissement des adorations du musulman au quotidien. Les différentes bra… @fr
definition: "Refers to the religious beliefs and social practices founded in the seventh century by the Arabian Prophet Muhammad, held to be the last of a series of major prophets, which include, according to Islamic dogma, Adam, Noah, and Jesus. It later spread throughout the Middle East, Africa, Europe, and parts of Asia. It is characterized by the belief in the fundamental idea that a devotee 'surrenders' and submits his will to Allah, the prime creator and sustainer of the universe and all creation. In Islam, God is unique and has no partner or intermediary as in the Christian Trinity. Social service and the active alleviation of suffering in others is considered the only path to salvation and prayer and sacred ritual alone are inadequate forms of submission to Allah. The Qur'an (Koran), the sacred text of the religion, is a compilation of revelations from Allah believed to have been received by Muhammad." (Getty, 2017)
definition: "Se refiere a creencias religiosas y prácticas sociales fundadas en el siglo VII por el Profeta árabe Mahoma, supuestamente el último de una serie de grandes profetas, incluídos, de acuerdo al dogma Islámico, Adán, Noé y Jesús. Posteriormente se difundió a través del Medio Oriente, África, Europa y parte de Asia. Se caracteriza por la creencia en la idea fundamental que un devoto se "rinde" y somete la voluntad de Alá, el principal creador y mantenedor del universo y toda creación. En el Islam, Dios es único y no tiene parentesco o intermediario como la trinidad cristiana. El servicio social y las actividades que alivian el sufrimiento de otros es considerado el único camino a la salvación y la oración y ritual sagrado a solas es una inadecuado forma de sumisión para Alá. El Coran (Koran), consagrado el texto de las religiones, es una compilación relevante de las creencias de Alá que fueron recibidas de Mahoma." (Getty, 2017) @es
definition: "Verwijst naar het samenstel van religieuze overtuigingen en sociale gebruiken dat in de 7de eeuw is ontstaan op basis van de leer van de Arabische profeet Mohammed, die wordt beschouwd als de laatste in een reeks van grote profeten; volgens de islamitische leer zijn dit onder anderen Adam, Noach en Jezus. De islam heeft zich later verspreid in het Midden-Oosten, Afrika, Europa en delen van Azië. De islam wordt gekenmerkt door het geloof in het fundamentele idee dat een gelovige zich 'overgeeft' en zich onderwerpt aan Allah, de schepper van het universum en de schepping als geheel. God is uniek en heeft geen partner of tussenpersoon zoals bij de christelijke drie-eenheid. Maatschappelijke dienstbaarheid en het actief verlichten van het lijden van anderen wordt beschouwd als de enige weg naar verlossing en gebeden en heilige rituelen zijn op zichzelf onvoldoende vormen van overgave aan Allah. De Qur'an (Koran), het heilige geschrift van de religie, is een verzameling onthullingen die, zo gelooft men, door Allah aan Mohammed zijn geopenbaard." (Getty, 2017) @nl
definition: "由阿拉伯先知穆罕默德於七世紀創建的宗教信仰與社會實踐方式。根據伊斯蘭教條，穆罕默德是繼亞當、挪亞、耶穌後最後一個主要的先知。此教之後廣傳中東、非洲、歐洲、及部份亞洲。基本思想為信徒交出自己的意志給阿拉(宇宙及所有創造物的最高造物者與支撐者)。就伊斯蘭教而言，神是獨一無二的，且并非如基督教三位一體的觀點般有夥伴或是媒介。社會服務及積極幫助受苦者被認為是通往救贖的唯一路徑，若只有祈禱及神聖儀式則不算完全奉獻予阿拉。可蘭經是此教的聖典，記載穆罕默德從阿拉得來的神示。" (Getty, 2017) @zh-hant
in scheme: religion

italian nationalist
in dataset: The CWRC Ontology
type: political affiliation
type: Concept
value: italian risorgimento
value: mazzinian
comment: The description for this term is indebted to DBpedia.
label: Italian nationalism
label: nationalisme Italien @fr
broader transitive: nationalism
definition: Défense pour l'unification de l'Italie en un même pays ou nationalisme italien. Voir Risorgimento — Wikipédia @fr
definition: Support for the unification of Italy as a single nation or of Italian nationalism. See Italian nationalism - Wikipedia; Italian unification - Wikipedia
in scheme: political affiliation

jacobin
in dataset: The CWRC Ontology
type: political affiliation
type: Concept
comment: La description de ce terme est basée sur celle de DBPedia. @fr
comment: The description for this term is indebted to DBpedia.
label: Jacobinism
label: Jacobinisme @fr
broader transitive: pro-revolutionary
definition: "A Jacobin was a member of the Jacobin Club, a revolutionary political movement that was the most famous political club during the French Revolution (1789–99). The club was so called from the Dominican convent where they originally met, in the Rue Saint-Jacques (Latin: Jacobus) in Paris. Today, Jacobin and Jacobinism are used in a variety of senses. Jacobin is sometimes used in Britain as a pejorative for radical, left-wing revolutionary politics, especially when it exhibits dogmatism and violent repression. In France, Jacobin now generally indicates a supporter of a centralized republican state and strong central government powers and/or supporters of extensive government intervention to transform society".(DBpedia, 2017)
definition: "Le jacobinisme est une doctrine politique qui défend la souveraineté populaire et l'indivisibilité de la République française. Il tient son nom du club des Jacobins, dont les membres s'étaient établis pendant la Révolution française dans l'ancien couvent des Jacobins à Paris. Le mot jacobinisme désigne aujourd'hui une doctrine qui tend à organiser le pouvoir de façon administrative (bureaucratie) et centralisée (centralisation) et à le faire exercer par une petite élite de techniciens (technocratie) qui étendent leur compétence à tous les échelons géographiques et à tous les domaines de la vie sociale afin de les rendre uniformes, ce qui en fait l'adversaire du régionalisme. L'usage moderne du mot jacobinisme est de quelque manière anachronique. En effet, le jacobinisme, pendant la révolution française, était une réaction aux enjeux particuliers de l'époque. Pour n'en retenir que la philosophie, on pourrait aussi entendre jacobinisme comme une doctrine opposée aux politiques communautaires, qui tendrait, par exemple, aux divisions internes. Comme mouvement historique, le jacobinisme peut s'apparenter au XVIIIe siècle en Autriche au joséphisme et au XXe siècle en URSS au centralisme bureaucratique." (DBpedia, 2017) @fr
in scheme: political affiliation

Jacobism
in dataset: The CWRC Ontology
type: political affiliation
type: Concept
comment: La description de ce terme est basée sur celle de DBPedia. @fr
comment: The description for this term is indebted to DBpedia.
label: Club des Jacobins @fr
broader transitive: pro-revolutionary
definition: "La Société des amis de la Constitution, plus connue ensuite sous le nom de club des Jacobins, est le plus célèbre des clubs de la Révolution française. «C’est ici que s’est préparée la Révolution, dit Georges Couthon en 1793, c’est ici qu’elle s’est faite, c’est ici que se sont préparés tous les grands événements». Appelé d'abord Club breton, le club tient son nom du couvent des Jacobins de la rue Saint-Honoré (Collège des Jacobins) où il s’est installé en 1789, dans une salle louée par le couvent de l'Annonciation, fondé entre 1611 et 1613 par Sébastien Michaëlis comme extension du Couvent des Jacobins de la rue Saint-Jacques (Jacobus en latin). Le Club des Jacobins est une société de pensée qui a constitué, pendant la Révolution française, à la fois un groupe de pression et un réseau d’une remarquable efficacité. L’action du club, essentielle dès le début de 1790, devient dominante entre 1792 et 1794. À cette époque, l’adjectif «jacobin» signifie partisan de la politique du Comité de salut public. À la fin de 1793, environ 6 000 sociétés de même type sont en correspondance avec lui dans toute la France. La chute de Robespierre marque la fin du grand rôle politique exercé par le club et entraîne sa dissolution en novembre 1794. Depuis cette époque, le nom et l’adjectif s’appliquent à un homme, une femme ou un courant politique hostile à toute idée d’affaiblissement et de démembrement de l’État." (DBpedia, 2017) @fr
definition: "The Society of the Friends of the Constitution, after 1792 renamed Society of the Jacobins, Friends of Freedom and Equality (French: Société des Jacobins, amis de la liberté et de l'égalité), commonly known as the Jacobin Club (Club des Jacobins) or just collectively Jacobins, was the most famous and influential political club in the development of the French Revolution. Initially founded by anti-Royalist deputies from Brittany, the Club grew into a nationwide republican movement, with a membership estimated at a half million or more. The Jacobin Club was heterogeneous and included both prominent parliamentary factions of the early 1790s, the radical Mountain and the more moderate Girondists. In 1792–3, the Girondists (led by Brissot and including Thomas Paine) dominated the Jacobin Club and led the country. Believing that revolutionary France would not be accepted by its neighbours, they called for an aggressive foreign policy and forced war on Austria. The Girondists were the dominant faction when the Jacobins overthrew the monarchy and created the republic. When the Republic failed to deliver the unrealistic gains that had been expected, they lost popularity. The Girondists sought to curb fanatical revolutionary violence, and were therefore accused by the Mountain of being royalist sympathisers. The National Guard eventually switched its support from the Girondists to the Mountain, allowing the Mountain to stage a coup d'etat. In May 1793, led by Maximilien de Robespierre, the leaders of the Mountain faction succeeded in sidelining the Girondist faction and controlled the government until July 1794. Their time in government was characterized by radically progressive legislation imposed with very high levels of political violence. In June 1793, they approved the Constitution of Year 1 which introduced universal male suffrage for the first time in history. In September 1793, twenty-one prominent Girondists were guillotined, beginning the Reign of Terror. In Octobe…
in scheme: political affiliation
related: Girondin

jacobite
in dataset: The CWRC Ontology
type: political affiliation
type: Concept
comment: La description de ce terme est basée sur celle de DBPedia. @fr
comment: The description for this term is indebted to DBpedia.
label: Jacobitism
label: Jacobitisme @fr
broader transitive: catholic
definition: "Jacobitism (/ˈdʒækəbaɪˌtɪzm/ JAK-ə-beye-TIZ-əm;Irish: Seacaibíteachas, Séamusachas, Scottish Gaelic: Seumasachas) was a political movement in Great Britain and Ireland that aimed to restore the Roman Catholic Stuart King James VII of Scotland, II of England and Ireland, and his heirs to the thrones of England, Scotland and Ireland. The movement took its name from Jacobus, the Renaissance Latin form of Iacomus, the original Latin form of James. Adherents rebelled against the British government on several occasions between 1688 and 1746. After James II was deposed in 1688 and replaced by his daughter Mary II, ruling jointly with her husband and first cousin (James's nephew) William III, the Stuarts lived in exile, occasionally attempting to regain the throne. The strongholds of Jacobitism were parts of the Scottish Highlands and the lowland north-east of Scotland, Ireland, and parts of Northern England (mostly within the counties of Northumberland and Lancashire). Significant support also existed in Wales and South-West England. The Jacobites believed that parliamentary interference with the line of succession to the English and Scottish thrones was illegal. Catholics also hoped the Stuarts would end recusancy. In Scotland, the Jacobite cause became intertwined with the last throes of the warrior clan system. The emblem of the Jacobites is the White Cockade. White Rose Day is celebrated on 10 June, the anniversary of the birth of the Old Pretender in 1688." (DBpedia, 2017)
definition: "Le «jacobitisme» historique est un mouvement politique proche des Tories entre 1688 et 1807, composé de ceux qui soutenaient la dynastie détrônée des Stuarts et considéraient comme usurpateurs tous les rois et les reines britanniques ayant régné pendant cette période. Soutenu par les monarchies catholiques françaises et espagnoles, il était surtout implanté en Irlande et dans les Highlands d'Écosse qui furent le théâtre de plusieurs révoltes soutenues par la France. Plus marginalement, le jacobitisme disposait également d'un certain nombre de partisans dans le nord de l'Angleterre et au Pays de Galles. En 1688, le roi Jacques II d'Angleterre et d'Irlande et VII d'Écosse (1633-1701) fut détrôné par un coup d’État, appelé par les historiens Glorieuse Révolution, mené par une armée hollandaise de 25 000 hommes, dont plus de 7 000 huguenots français. Le roi est chassé et une bonne partie de ses pouvoirs transmis au parlement, où les lois seront élaborées par le parti whig. Les royalistes britanniques qui lui étaient restés fidèles, de même qu'à ses successeurs, sont connus sous le nom de jacobites car le prénom du roi, en latin, est «Jacobus». Les historiens évaluent à 40 000 le nombre de réfugiés jacobites en France, qui ont émigré après la Glorieuse Révolution, dont environ 60 % étaient irlandais, 34 % anglais et 6 % écossais. Parmi eux, 40 % étaient de familles aristocratiques, dont un grand nombre d'officiers de l'armée du roi. En France, ils ont constitué la Cour jacobite de Saint-Germain en Laye et la puissante communauté des Irlandais de Nantes. Apparu plus tard, le jacobitisme dit «moderne» est un mouvement très marginal composé de ceux qui considèrent qu'étaient illégitimes tous les rois et les reines ayant régné sur les pays de l'Empire britannique et du Commonwealth après 1688, en particulier parce que ces souverains ont abdiqué une grande part de leur pouvoir en faveur du parlement. Les jacobites modernes considèrent que la reine Elisabeth II (née en 1926, … @fr
in scheme: political affiliation

Jewish emancipation
in dataset: The CWRC Ontology
contrary to: anti-semitism
type: political affiliation
type: Concept
comment: La description de ce terme est basée sur celle de DBPedia. @fr
comment: The description for this term is indebted to DBpedia.
label: Émancipation des Juifs @fr
broader transitive: civil rights
definition: "Jewish emancipation was the external (and internal) process in various nations in Europe of eliminating Jewish disabilities, e.g. Jewish quotas, to which Jewish people were then subject, and the recognition of Jews as entitled to equality and citizenship rights on a communal, not merely individual, basis. It included efforts within the community to integrate into their societies as citizens. It occurred gradually between the late 18th century and the early 20th century. Jewish emancipation followed the Age of Enlightenment and the concurrent Jewish enlightenment. Various nations repealed or superseded previous discriminatory laws applied specifically against Jews where they resided. Before the emancipation, most Jews were isolated in residential areas from the rest of the society; emancipation was a major goal of European Jews of that time, who worked within their communities to achieve integration in the majority societies and broader education. Many became active politically and culturally within wider European civil society as Jews gained full citizenship. They emigrated to countries offering better social and economic opportunities, such as the Russian Empire and France. Some European Jews turned to Socialism, others to Jewish nationalism: Zionism." (DBpedia, 2017)
definition: "L'émancipation des Juifs désigne le processus de libération des Juifs en Europe et dans le monde, qui leur a permis d'obtenir la citoyenneté et la pleine égalité de leurs droits avec leurs concitoyens. Si la France a été la première à attribuer la pleine égalité de droits aux Juifs par le vote de l'Assemblée constituante en 1791 au début de la Révolution française, il faut rappeler que le processus d'émancipation a débuté juridiquement avec l'Édit de tolérance de Joseph II d'Autriche (1781) qui accorde la liberté de culte aux Protestants comme aux Juifs, l'Édit de tolérance de Louis XVI (1787) et en Allemagne avec la conjonction de la philosophie des Lumières et de la Haskalah (dont le plus illustre représentant est Moïse Mendelssohn). L'émancipation se traduit par une série d'actes législatifs par laquelle les états ont reconnu la citoyenneté aux Juifs. En France, la Terreur a empêché un temps chrétiens et juifs de pratiquer leur religion, mais l'égalité de droits a été confirmée sous Napoléon Ier. Dans le reste de l'Europe, l'émancipation qui s'est faite au XIXe siècle, a conduit à la disparition au moins formelle des ghettos et à l'égalité des chances pour les Juifs, en Europe occidentale et en Amérique. Là où elle s'est heurtée à une plus grande opposition, dans l'Empire russe particulièrement, les Juifs se sont plus volontiers tournés vers les mouvements révolutionnaires ou le sionisme." (DBpedia, 2017) @fr
in scheme: political affiliation

Jew
in dataset: The CWRC Ontology
type: ethnicity
type: Thing
type: Concept
value: Jewish
value: Jewry
value: Jews
value: Judaism
value: a Jewish
value: one-quarter Jewish
label: Juif @fr
broader: Jewish
definition: "The Jews (/dʒuːz/; Hebrew: יְהוּדִים ISO 259-3 Yehudim, Israeli pronunciation [jehuˈdim]), also known as the Jewish people, are an ethnoreligious group originating from the Israelites, or Hebrews, of the Ancient Near East. Jewish ethnicity, nationhood and religion are strongly interrelated, as Judaism is the traditional faith of the Jewish nation, while its observance varies from strict observance to complete nonobservance. Jews originated as a national and religious group in the Middle East during the second millennium BCE, in the part of the Levant known as the Land of Israel. The Merneptah Stele appears to confirm the existence of a people of Israel, associated with the god El, somewhere in Canaan as far back as the 13th century BCE (Late Bronze Age). The Israelites, as an outgrowth of the Canaanite population, consolidated their hold with the emergence of the Kingdom of Israel, and the Kingdom of Judah. Some consider that these Canaanite sedentary Israelites melded with incoming nomadic groups known as 'Hebrews'. Though few sources in the Bible mention the exilic periods in detail, the experience of diaspora life, from the Ancient Egyptian rule over the Levant, to Assyrian Captivity and Exile, to Babylonian Captivity and Exile, to Seleucid Imperial rule, to the Roman occupation, and the historical relations between Israelites and their homeland, became a major feature of Jewish history, identity and memory. The worldwide Jewish population reached a peak of 16.7 million prior to World War II, but approximately 6 million Jews were systematically murdered during the Holocaust. Since then the population has slowly risen again, and as of 2015 was estimated at 14.3 million by the Berman Jewish DataBank, or less than 0.2% of the total world population (roughly one in every 514 people). According to the report, about 43% of all Jews reside in Israel (6.4 million), and 40% in the United States (5.7 million), with most of the remainder living in Europe (1.4 million) and …
definition: «Les Juifs (en hébreu : יְהוּדִים / yehoudim, en grec ancien : Ἰουδαῖοι / Ioudaĩoi, en latin : Iudaei, etc.) sont les membres d’un peuple lié à sa propre religion, le judaïsme, et au sens large du terme à une appartenance ethnique et religieuse. La tradition juive relie leur ascendance aux patriarches Abraham, Isaac et Jacob également appelé Israël. Ils peuplent la Judée et le royaume d'Israël, structurant leur quotidien autour de la Bible hébraïque, laquelle comprend les cinq Livres de la Torah attribués à Moïse, les Livres des prophètes ultérieurs et d’autres écrits. La Bible définit leurs croyances, leur histoire, leur identité nationale et légifère dans tous les domaines de leur vie. À la suite des aléas de leur histoire, les Juifs migrent ou sont déportés de la Judée et essaiment à travers le monde. La diaspora juive résulte principalement de la conjonction de deux facteurs, une volonté d'essaimage et la nécessité de fuir des persécutions. Tentant de conserver leur mode de vie ancestral au sein des populations avoisinantes dans lesquelles ils s’acculturent, ils développent des traditions religieuses, culinaires et des langues propres ainsi que d’autres traits spécifiques. Réciproquement, ils exercent un certain attrait sur leurs populations d’accueil et l’on enregistre dans l’Empire romain un nombre important de conversions au judaïsme. L’impact et la proportion de ces conversions font débat au sein des historiens. Leur histoire sur plus de deux millénaires en Europe est marquée par des persécutions qui culminent au xxe siècle avec la Shoah. Les grandes révolutions de l’ère moderne entraînent chez nombre d’entre eux une perte ou un abandon de tout ou partie des repères traditionnels. Plusieurs tentatives sont menées pour les redéfinir en tant qu’entité confessionnelle, nationale ou culturelle de sorte qu’en français, l'usage commun distingue entre les Juifs (avec une majuscule — les 'personnes descendant de l'ancien peuple d'Israël') et les juifs (sans majuscul… @fr
in scheme: ethnicity
name: Jewish (Ethnicity)

Jewish
in dataset: The CWRC Ontology
type: geographic heritage
type: Thing
type: Concept
label: Juif @fr
broader: Jewish
definition: Indicates a subject's identification with or labelling as of Jewish heritage in relation to a place, which may or may not be Israel.
in scheme: geographic heritage
name: Jewish (Geographic Heritage)

Jewish
in dataset: The CWRC Ontology
has literal form: Jewish
has literal form: Juif @fr
type: textual label
type: Concept
label: Juif @fr
one of: Judaism
one of: jew
one of: Jew
one of: Jewish
definition: A subclass of textual label, this discursive label reflects the ambiguity of Jewishness associated with different cultural forms. It provides a means of aggregating and searching multiple instances of "Jewish" (e.g. Jewish, Jewish) cultural identities.
in scheme: textual label

Jewish
in dataset: The CWRC Ontology
type: nationality
type: Thing
type: Concept
label: Juif @fr
broader: jewishlabel
definition: Indicates a subject's identification with or labelling as Jewish or Israeli as a national identity.
in scheme: nationality
related match: Zionism

jew
in dataset: The CWRC Ontology
type: race or colour
type: Thing
type: Concept
label: Jewish
label: Juif @fr
definition: "The Jews (/dʒuːz/; Hebrew: יְהוּדִים ISO 259-3 Yehudim, Israeli pronunciation [jehuˈdim]), also known as the Jewish people, are an ethnoreligious group originating from the Israelites, or Hebrews, of the Ancient Near East. Jewish ethnicity, nationhood and religion are strongly interrelated, as Judaism is the traditional faith of the Jewish nation, while its observance varies from strict observance to complete nonobservance. Jews originated as a national and religious group in the Middle East during the second millennium BCE, in the part of the Levant known as the Land of Israel. The Merneptah Stele appears to confirm the existence of a people of Israel, associated with the god El, somewhere in Canaan as far back as the 13th century BCE (Late Bronze Age). The Israelites, as an outgrowth of the Canaanite population, consolidated their hold with the emergence of the Kingdom of Israel, and the Kingdom of Judah. Some consider that these Canaanite sedentary Israelites melded with incoming nomadic groups known as 'Hebrews'. Though few sources in the Bible mention the exilic periods in detail, the experience of diaspora life, from the Ancient Egyptian rule over the Levant, to Assyrian Captivity and Exile, to Babylonian Captivity and Exile, to Seleucid Imperial rule, to the Roman occupation, and the historical relations between Israelites and their homeland, became a major feature of Jewish history, identity and memory. The worldwide Jewish population reached a peak of 16.7 million prior to World War II, but approximately 6 million Jews were systematically murdered during the Holocaust. Since then the population has slowly risen again, and as of 2015 was estimated at 14.3 million by the Berman Jewish DataBank, or less than 0.2% of the total world population (roughly one in every 514 people). According to the report, about 43% of all Jews reside in Israel (6.4 million), and 40% in the United States (5.7 million), with most of the remainder living in Europe (1.4 million) and …
definition: «Les Juifs (en hébreu : יְהוּדִים / yehoudim, en grec ancien : Ἰουδαῖοι / Ioudaĩoi, en latin : Iudaei, etc.) sont les membres d’un peuple lié à sa propre religion, le judaïsme, et au sens large du terme à une appartenance ethnique et religieuse. La tradition juive relie leur ascendance aux patriarches Abraham, Isaac et Jacob également appelé Israël. Ils peuplent la Judée et le royaume d'Israël, structurant leur quotidien autour de la Bible hébraïque, laquelle comprend les cinq Livres de la Torah attribués à Moïse, les Livres des prophètes ultérieurs et d’autres écrits. La Bible définit leurs croyances, leur histoire, leur identité nationale et légifère dans tous les domaines de leur vie. À la suite des aléas de leur histoire, les Juifs migrent ou sont déportés de la Judée et essaiment à travers le monde. La diaspora juive résulte principalement de la conjonction de deux facteurs, une volonté d'essaimage et la nécessité de fuir des persécutions. Tentant de conserver leur mode de vie ancestral au sein des populations avoisinantes dans lesquelles ils s’acculturent, ils développent des traditions religieuses, culinaires et des langues propres ainsi que d’autres traits spécifiques. Réciproquement, ils exercent un certain attrait sur leurs populations d’accueil et l’on enregistre dans l’Empire romain un nombre important de conversions au judaïsme. L’impact et la proportion de ces conversions font débat au sein des historiens. Leur histoire sur plus de deux millénaires en Europe est marquée par des persécutions qui culminent au xxe siècle avec la Shoah. Les grandes révolutions de l’ère moderne entraînent chez nombre d’entre eux une perte ou un abandon de tout ou partie des repères traditionnels. Plusieurs tentatives sont menées pour les redéfinir en tant qu’entité confessionnelle, nationale ou culturelle de sorte qu’en français, l'usage commun distingue entre les Juifs (avec une majuscule — les «personnes descendant de l'ancien peuple d'Israël») et les juifs (sans majuscul… @fr
in scheme: race or colour

Jewish
is replaced by: Judaism
in dataset: The CWRC Ontology
type: Concept
comment: Deprecated in favour of instance Judaism.
comment: Désapprouver en faveur de l'instance Judaïsme. @fr
comment: La description de ce terme est basée sur celle de DBPedia. @fr
comment: The description for this term is indebted to the Getty Art & Architecture Thesaurus.
label: Jodendom @nl
label: Joods @nl
label: Judaísmo @es
label: Judaïsme @fr
label: you tai jiao @zh-latn
label: yu t'ai chiao @zh-latn
label: yóu tài jiāo @zh-latn
label: 猶太教 @zh-hant
deprecated: true
term status: deprecated
broader: Jewish
broader transitive: Abrahamic religions
definition: "Le judaïsme (du grec Ιουδαϊσμός, yiddish : יידישקייט yiddishkeit, ladino : ג’ודאיסמו Djudaismo, allemand : Judenthum, hébreu : יהדות yahadout) est variablement défini comme «une forme de vie religieuse dont la caractéristique essentielle est la croyance à un Être suprême, auteur — de quelque manière qu'on conçoive son action — de l'univers qu'il gouverne par sa providence», ou comme «la religion des Juifs, ainsi que la théologie, la loi et les traditions culturelles du peuple juif», ou comme «une religion […], une culture — résultat ou fondement de la religion, mais ayant un devenir propre, […] une sensibilité diffuse faite de quelques idées et souvenirs, de quelques coutumes et émotions, d’une solidarité avec les juifs persécutés en tant que juifs» ou comme «l'ensemble des rituels et des autres pratiques, des croyances et des valeurs, des loyautés historiques et politiques qui constituent l'allégeance au peuple d'Israël». Cette pluralité est tributaire d’une part de l’évolution du terme au cours de l’histoire, celui-ci désignant originellement l’ensemble des traits caractérisant le peuple juif, constitué des descendants des Israélites provenant de l’antique terre d'Israël et de ceux qui les ont rejoints par la conversion, et d’autre part de la différence de perception selon l'appartenance ou non au judaïsme. Il a souvent été représenté comme une «religion juive» antithétique de la religion chrétienne, alors que des Juifs le définissent aussi au-delà ou en dehors du fait religieux, certains philosophes, comme Daniel Boyarin ou Bernard-Henri Lévy, allant jusqu’à dire que la religion en tant que théologie édifiée par une croyance, des dogmes et une instance suprême, centrale et doctrinale «n’appartient pas à l’esprit du judaïsme»." (DBpedia, 2017) @fr
definition: "Refers to the monotheistic religion of the Jewish people, central to which is the belief that the ancient Israelites experienced God's presence in human events. Jews believe that the one God delivered the Israelites out of bondage in Egypt, revealed the structure of communal and individual life to them, and chose them to be a holy nation of people able to set an example for all humankind. The Hebrew Bible and Talmud are the two primary sources for Judaism's spiritual and ethical principles. The religion, which traces its origins to Abraham, places more emphasis on expressing beliefs through ritual rather than through abstract doctrine. The Sabbath, beginning at sunset on Friday and ending at sunset on Saturday, is the central religious observance; there is also an annual cycle of religious festivals and days of fasting. Judaism has had a diverse history of development over almost 4000 years, with a number of resulting branches in modern times, namely Orthodox, Conservative, and Reform." (Getty, 2017)
definition: "Se refiere a la religión monoteista del pueblo judío, para los cuales es central la creencia que los antiguos israelitas experimentaron la presencia de Dios en los eventos humanos. Los judíos creen que el Dios único salvó los israelistas de la esclavitud en Egipto, revelándoles la estructura de la vida comunal e individual y eligiéndolos para ser una nación sagrada de personas capaces de dar un ejemplo para toda la humanidad. La Biblia Hebrea y el Talmud son dos fuentes primarias de la espiritualidad judía y de los principios éticos.Los orígenes de la religión se remontan a los tiempos de Abraham, poniendo mayor énfasis en expresar la creencia con rituales más bien que con doctrinas abstractas. El Shabbat, que comienza con la puesta de sol del viernes y termina con la puesta de sol del sábado, es la observancia religiosa central; hay también un ciclo anual de fiestas religiosas y días de ayuno. El judaísmo ha tenido un desarrollo diverso a lo largo de la historia de casi 4.000 años, con un gran número de ramas resultantes en épocas modernas, concretamente ortodoxas, conservadoras, y reformistas." (Getty, 2017) @es
definition: "Verwijst naar de monotheïstische religie van het joodse volk, waarbij het geloof centraal staat dat de oude Israëlieten de aanwezigheid van God ervoeren in menselijke gebeurtenissen. Joden geloven dat één God de Israëlieten uit hun gevangenschap in Egypte heeft bevrijd, de structuur van een gemeenschappelijk en individueel leven aan hen heeft onthuld en hen heeft uitverkoren als een heilig volk dat als voorbeeld moest dienen voor de gehele mensheid. De Hebreeuwse bijbel en de Talmoed zijn de belangrijkste bronnen voor de spirituele en ethische principes van het jodendom. Deze religie, waarvan de oorsprong teruggaat naar de tijd van Abraham, legt meer de nadruk op het tot uitdrukking brengen van het geloof in de vorm van rituelen dan in de vorm van abstracte doctrines. De sabbat, die begint bij zonsondergang op vrijdag en eindigt bij zonsondergang op zaterdag, is een centraal element van de religie; er is ook een jaarlijkse cyclus van religieuze feestdagen en vastendagen. Het jodendom heeft een zeer uiteenlopende ontwikkelingsgeschiedenis die bijna 4000 jaar beslaat en is uitgemond in diverse stromingen: de orthodoxe, conservatieve en reformistische stroming." (Getty, 2017) @nl
definition: "猶太人的一神論宗教，相信古代以色列人於人類事件中體驗到神的存在。猶太人相信這唯一的神使他們脫離埃及的奴役，向他們揭示公共及個人生活的結構，並選擇他們為聖國子民，以為全人類樹立榜樣。《希伯來聖經(Hebrew Bible)》與《塔爾穆德(Talmud)》為猶太教精神與道德原則的兩大來源。猶太教源於亞伯拉罕，較強調以儀式而非抽象的教條表達信仰。遵循信仰的重心為安息日，從週五的日落開始到週日的日出結束；另外每年還有宗教節慶和齋戒日。猶太教經過將近四千年的發展，衍生出許多現代的分支，即正統派猶太教(Orthodox)、保守派猶太教(Conservative)，與改革派猶太教(Reform.)。" (Getty, 2017) @zh-hant
in scheme: religion

Judaism
in dataset: The CWRC Ontology
type: religion
type: Thing
type: Concept
comment: La description de ce terme est basée sur celle de DBPedia. @fr
comment: The description for this term is indebted to the Getty Art & Architecture Thesaurus.
label: Jodendom @nl
label: Joods @nl
label: Judaísmo @es
label: Judaïsme @fr
label: you tai jiao @zh-latn
label: yu t'ai chiao @zh-latn
label: yóu tài jiāo @zh-latn
label: 猶太教 @zh-hant
broader: Jewish
broader transitive: Abrahamic religions
definition: "Pour l'Encyclopædia Britannica, le mot judaïsme recouvre la religion des Juifs, ainsi que la théologie, la loi et les traditions culturelles du peuple juif, constitué des descendants des Israélites provenant de l'antique terre d'Israël et des quelques minorités les ayant rejoints par la conversion et s'étant mélangées à eux au fil de leur diaspora de deux millénaires. Pour un juif orthodoxe comme Daniel Boyarin, le judaïsme est «l'ensemble des rituels et des autres pratiques, des croyances et des valeurs, des loyautés historiques et politiques qui constituent l'allégeance au peuple d'Israël», mais le judaïsme n’est ni une religion ni une foi, selon Boyarin. Ainsi Bernard-Henri Lévy affirme que «la tâche des Juifs comme tels est d’être irréligieux», dans la mesure où la religion, telle qu'on la conçoit en théologie, édifiée par une croyance, par des dogmes, par une instance suprême, centrale et doctrinale, n’appartient pas à l’esprit du judaïsme, selon lui. Le judaïsme comporte des éléments religieux, mais ne s'y limite pas puisqu'il contient des coutumes non spécifiquement religieuses – outre des codes de conduite, des lois, des rites – et qu’il fonde plus largement encore une «culture juive». Néanmoins, par convention, on parle habituellement du judaïsme comme d’une «religion», mais il ne faut pas l’entendre au sens strict, selon des historiens des religions comme Simon Claude Mimouni ou Daniel Boyarin, ou des philosophes comme Léo Strauss ou Bernard-Henri Lévy. Selon ses textes fondateurs, en particulier le Tanakh, la foi des anciens Israélites et de leurs descendants les Juifs, est fondée sur une alliance contractée entre Dieu et Abraham, qui a ensuite été renouvelée entre Dieu et Moïse. Les juifs fondent le judaïsme sur la religion abrahamique qui fleurira ensuite dans la Loi mosaïque (la Torah, les Nevi'im et les Ketouvim), collectivement désignés par l'acronyme Tanakh, dont le texte constitue la Miqra ou Bible hébraïque. Cette religion se fonde sur le culte d… @fr
definition: "Refers to the monotheistic religion of the Jewish people, central to which is the belief that the ancient Israelites experienced God's presence in human events. Jews believe that the one God delivered the Israelites out of bondage in Egypt, revealed the structure of communal and individual life to them, and chose them to be a holy nation of people able to set an example for all humankind. The Hebrew Bible and Talmud are the two primary sources for Judaism's spiritual and ethical principles. The religion, which traces its origins to Abraham, places more emphasis on expressing beliefs through ritual rather than through abstract doctrine. The Sabbath, beginning on sunset on Friday and ending at sunset on Saturday, is the central religious observance; there is also an annual cycle of religious festivals and days of fasting. Judaism has had a diverse history of development over almost 4000 years, with a number of resulting branches in modern times, namely Orthodox, Conservative, and Reform." (Getty, 2017)
definition: "Se refiere a la religión monoteista del pueblo judío, para los cuales es central la creencia que los antiguos israelitas experimentaron la presencia de Dios en los eventos humanos. Los judíos creen que el Dios único salvó los israelistas de la esclavitud en Egipto, revelándoles la estructura de la vida comunal e individual y eligiéndolos para ser una nación sagrada de personas capaces de dar un ejemplo para toda la humanidad. La Biblia Hebrea y el Talmud son dos fuentes primarias de la espiritualidad judía y de los principios éticos.Los orígenes de la religión se remontan a los tiempos de Abraham, poniendo mayor énfasis en expresar la creencia con rituales más bien que con doctrinas abstractas. El Shabbat, que comienza con la puesta de sol del viernes y termina con la puesta de sol del sábado, es la observancia religiosa central; hay también un ciclo anual de fiestas religiosas y días de ayuno. El judaísmo ha tenido un desarrollo diverso a lo largo de la historia de casi 4.000 años, con un gran número de ramas resultantes en épocas modernas, concretamente ortodoxas, conservadoras, y reformistas." (Getty, 2017) @es
definition: "Verwijst naar de monotheïstische religie van het joodse volk, waarbij het geloof centraal staat dat de oude Israëlieten de aanwezigheid van God ervoeren in menselijke gebeurtenissen. Joden geloven dat één God de Israëlieten uit hun gevangenschap in Egypte heeft bevrijd, de structuur van een gemeenschappelijk en individueel leven aan hen heeft onthuld en hen heeft uitverkoren als een heilig volk dat als voorbeeld moest dienen voor de gehele mensheid. De Hebreeuwse bijbel en de Talmoed zijn de belangrijkste bronnen voor de spirituele en ethische principes van het jodendom. Deze religie, waarvan de oorsprong teruggaat naar de tijd van Abraham, legt meer de nadruk op het tot uitdrukking brengen van het geloof in de vorm van rituelen dan in de vorm van abstracte doctrines. De sabbat, die begint bij zonsondergang op vrijdag en eindigt bij zonsondergang op zaterdag, is een centraal element van de religie; er is ook een jaarlijkse cyclus van religieuze feestdagen en vastendagen. Het jodendom heeft een zeer uiteenlopende ontwikkelingsgeschiedenis die bijna 4000 jaar beslaat en is uitgemond in diverse stromingen: de orthodoxe, conservatieve en reformistische stroming." (Getty, 2017) @nl
definition: "猶太人的一神論宗教，相信古代以色列人於人類事件中體驗到神的存在。猶太人相信這唯一的神使他們脫離埃及的奴役，向他們揭示公共及個人生活的結構，並選擇他們為聖國子民，以為全人類樹立榜樣。《希伯來聖經(Hebrew Bible)》與《塔爾穆德(Talmud)》為猶太教精神與道德原則的兩大來源。猶太教源於亞伯拉罕，較強調以儀式而非抽象的教條表達信仰。遵循信仰的重心為安息日，從週五的日落開始到週日的日出結束；另外每年還有宗教節慶和齋戒日。猶太教經過將近四千年的發展，衍生出許多現代的分支，即正統派猶太教(Orthodox)、保守派猶太教(Conservative)，與改革派猶太教(Reform.)。" (Getty, 2017) @zh-hant
in scheme: religion

anti-sweated labour
in dataset: The CWRC Ontology
contrary to: anti-trade-unionist
type: political affiliation
type: Concept
value: factory reformer
value: labour activism
value: labour activist
value: labour advocate
value: labour feminist
value: labour organizer
value: women's labour activist
comment: La description de ce terme est basée sur celle de DBPedia. @fr
comment: The description for this term is indebted to DBpedia.
label: Mouvement ouvrier @fr
label: labour movement
definition: "Le terme de mouvement ouvrier désigne l'ensemble des mouvements et partis organisés, à partir de l'époque de la révolution industrielle, pour améliorer les conditions d'existence de la classe ouvrière. Cette définition inclut principalement le syndicalisme, mais aussi les partis politiques en étant issus ou s'en étant réclamés et plus largement les différentes formes d'action politique et sociale ayant représenté, ou estimé représenter, les intérêts de la classe ouvrière (coopératisme, mutualisme). Plus particulièrement, au XIXe siècle, la mouvance socialiste — qui adopte dans une partie des pays européens l'appellation de social-démocrate — se pose en représentant du mouvement ouvrier. La nature des liens entre syndicalisme et partis politiques est cependant variable selon les pays : au Royaume-Uni, la précocité du développement industriel a entraîné l'antériorité des syndicats sur le Parti travailliste. Après la scission de la mouvance socialiste au début du XXe siècle, les partis communistes et, prise au sens large, la mouvance communiste dans son ensemble, se sont présentés comme les représentants authentiques du mouvement ouvrier. Les anarchistes ont également pu revendiquer la représentation des intérêts du monde ouvrier, notamment via des phénomènes comme l'anarcho-syndicalisme." (DBpedia, 2017) @fr
definition: "The Labour movement or Labor movement (see spelling differences), or, respectively, labourism or laborism, are general terms for the collective organisation of working people developed to represent and campaign for better working conditions and treatment from their employers and, by the implementation of labour and employment laws, their governments. The standard unit of organisation is the trade union. In some countries, especially the United Kingdom and Australia, the labour movement is understood to include a formal political wing, usually as a political party known as a "labour party" or "workers' party". Many individuals and political groups otherwise considered to represent ruling classes may be part of and active in the labour movement. Contemporary labourism developed in response to the depredations of industrial capitalism at about the same time as socialism. However, while the goal of labourism was to protect and strengthen the interests of labour within capitalism, the goal of socialism was to replace the capitalist system entirely." (DBpedia, 2017)
in scheme: political affiliation
related: progressivism
related: militant socialist

anti-conservative
in dataset: The CWRC Ontology
type: political affiliation
type: Concept
value: leftist
comment: La description de ce terme est basée sur celle de DBPedia. @fr
comment: The description for this term is indebted to DBpedia.
label: Gauche (politique) @fr
label: left-wing
definition: "En politique, l'usage consiste à diviser les partis politiques en catégories générales qui formalisent une division bipartisane : la droite et la gauche, auxquelles on peut ajouter le centre. Dans l'ensemble du champ politique, les forces politiques sont triples : droite, gauche et forces révolutionnaires (extrême-gauche) hors partis. La notion de gauche et celle de droite en politique est une construction progressive entre la fin du XVIIIe siècle et le début du XXe siècle. La gauche désigne la partie gauche de l'hémicycle d'une assemblée parlementaire et les personnes et partis qui y siègent habituellement. De ce fait, la notion de gauche (comme celle de droite) ne possède pas un contenu idéologique fixe et a priori : par exemple, l'orléanisme est à gauche du légitimisme, le bourgeois libéral est à gauche du bourgeois monarchiste, et ce qui était à gauche à une époque se retrouve souvent à droite à une autre époque, ainsi le bourgeois libéral est aujourd’hui généralement à droite, alors qu'il est de gauche du temps de Benjamin Constant. De nos jours, les partis de gauche se rassemblent généralement dans la promotion d'idéaux progressistes et d'égalité, la critique de l'ordre social et le souci d'une plus grande justice sociale. Elle comprend la social-démocratie, le radicalisme, le socialisme, le communisme et certains courants de l'anarchisme.Le terme n'est pas utilisé que pour les partis, on utilise parfois le terme de gauche syndicale ou plus rarement de gauche associative." (DBpedia, 2017) @fr
definition: "Left-wing politics supports social equality and egalitarianism, often in opposition to social hierarchy and social inequality. It typically involves a concern for those in society whom its adherents perceive as disadvantaged relative to others (prioritarianism), as well as a belief that there are unjustified inequalities that need to be reduced or abolished (by advocating for social justice). The term left wing can also refer to "the radical, reforming, or socialist section of a political party or system". The political terms Left and Right were coined during the French Revolution (1789–1799), referring to the seating arrangement in the Estates General: those who sat on the left generally opposed the monarchy and supported the revolution, including the creation of a republic and secularization, while those on the right were supportive of the traditional institutions of the Old Regime. Use of the term "Left" became more prominent after the restoration of the French monarchy in 1815 when it was applied to the "Independents". The word "wing" was appended to Left and Right in the late 19th century, usually with disparaging intent, and "left-wing" was applied to those who were unorthodox in their religious or political views. The term was later applied to a number of movements, especially republicanism during the French Revolution in the 18th century, followed by socialism, communism, anarchism, and social democracy in the 19th and 20th centuries. Since then, the term left-wing has been applied to a broad range of movements including civil rights movements, feminist movements, anti-war movements, and environmental movements, as well as a wide range of parties. According to author Barry Clark, "Leftists [...] claim that human development flourishes when individuals engage in cooperative, mutually respectful relations that can thrive only when excessive differences in status, power, and wealth are eliminated." " (DBpedia, 2017)
in scheme: political affiliation

LESBIAN
in dataset: The CWRC Ontology
type: sexuality
type: Thing
type: Concept
value: LESBIANISM
label: lesbianism
label: lesbianisme @fr
definition: Le lesbianisme indique l’attraction sexuelle entre les femmes. Cependant, certaines intellectuelles lesbiennes féministes soulignent l’aspect réducteur d’une telle définition. S’appuyant sur Kathleen Gough, Adrienne Rich interprète l’hétérosexualité comme obligatoire pour les femmes dans un contexte patriarcal, et évoque un continuum lesbien, les «diverses expériences spécifiques aux femmes—au cours de leur existence ou à travers l’Histoire— et non simplement le fait qu’une femme a eu ou a consciemment désiré avoir des expériences sexuelles avec une autre femme» (Of Blood and Poetry, 1983). Dans un contexte hétéronormatif, le lesbianisme ne relève donc pas seulement de la sexualité mais implique aussi des questions politiques complexes. @fr
definition: Lesbianism indicates the sexual attraction of women to other women. Yet, lesbian feminist thinkers underline that this common definition is reductive. Drawing on Kathleen Gough and within an understanding of heterosexuality as compulsory for women within patriarchy, Adrienne Rich describes a lesbian continuum, the "range—through each woman's life and throughout history—of woman-identified experiences, not simply the fact that a woman has had or consciously desired genital sexual experience with another woman" (Of Blood Bread and Poetry, 1983). In a heteronormative context, lesbianism is not only a question of sexuality but also has complex political implications.
in scheme: sexuality
name: lesbian (sexual identity)

liberal unionist
in dataset: The CWRC Ontology
contrary to: home ruler
type: political affiliation
type: Concept
comment: La description de ce terme est basée sur celle de DBPedia. @fr
comment: The description for this term is indebted to DBpedia.
label: Liberal Unionist Party
label: Parti libéral unioniste @fr
broader transitive: liberal
definition: "The Liberal Unionist Party was a British political party that was formed in 1886 by a faction that broke away from the Liberal Party. Led by Lord Hartington (later the Duke of Devonshire) and Joseph Chamberlain, the party formed a political alliance with the Conservative Party in opposition to Irish Home Rule. The two parties formed the ten-year-long, coalition Unionist Government 1895–1905 but kept separate political funds and their own party organisations until a complete merger was agreed in May 1912." (DBpedia, 2017)
definition: Le Liberal Unionist Party est un parti politique britannique qui se sépara du Parti libéral en 1886. Dirigé par Spencer Cavendish (Lord Hartington, et plus tard duc du Devonshire) et Joseph Chamberlain, le parti a formé une alliance politique avec le Parti conservateur dans l'opposition à l’Home Rule de l'Irlande. Les deux partis ont formé un gouvernement de coalition en 1895, mais gardèrent un fonctionnement séparés jusqu'à une fusion complète en mai 1912. * Portail de la politique britannique" Portail de la politique britannique" (DBpedia, 2017) @fr
in scheme: political affiliation

liberal
in dataset: The CWRC Ontology
type: political affiliation
type: Concept
comment: La description de ce terme est basée sur celle de DBPedia. @fr
comment: The description for this term is indebted to DBpedia.
label: Libéralisme @fr
label: liberalism
definition: "Le libéralisme est une doctrine de philosophie politique qui affirme la liberté comme principe politique suprême ainsi que son corollaire de responsabilité individuelle, et revendique la limitation du pouvoir du souverain. Le mot libéralisme fait son apparition au début du XIXe siècle. Les racines du libéralisme sont plus anciennes. L'opposition à l'absolutisme du souverain s'est développée dans l’Europe des Lumières (XVIIIe siècle), mais aussi auparavant par la scolastique de l'École de Salamanque (XVIe siècle) faisant obligation morale au souverain de respecter les droits fondamentaux de chaque être humain au motif de sa nature de créature de Dieu, ou plus anciennement par les chartes médiévales (telles la Magna Carta) introduisant des droits fondamentaux dont le respect est exigé du souverain, ou encore par certains pans de la philosophie thomiste, eux-mêmes précédés par le principe de justice naturelle d'Aristote. La date des débuts formels du libéralisme ou de ses composantes politiques, économiques ou religieuses diffère selon les auteurs. De nombreux auteurs font commencer le libéralisme avec la Lettre sur la tolérance de John Locke (1689) qui complète les racines préexistantes. Le libéralisme repose sur l’idée que chaque être humain possède des droits fondamentaux naturels précédant toute association et qu'aucun pouvoir n'a le droit de violer. En conséquence, les libéraux veulent limiter les obligations sociales imposées par le pouvoir et plus généralement le système social, telles que la morale, au profit du libre choix et de l'intérêt de chaque individu indépendamment des autres. La question de l'articulation entre «libéralisme économique» et «libéralisme politique» reçoit des réponses variées. Le libéralisme prône la liberté d'expression des individus. Dans le domaine économique, il défend notamment l'initiative privée, la libre concurrence et son corollaire l'économie de marché ; dans le domaine politique, il accepte des pouvoirs politiques encadrés par… @fr
definition: "Liberalism is a political philosophy or worldview founded on ideas of liberty and equality. Whereas classical liberalism emphasises the role of liberty, social liberalism stresses the importance of equality. Liberals espouse a wide array of views depending on their understanding of these principles, but generally they support ideas and programmes such as freedom of speech, freedom of the press, freedom of religion, free markets, civil rights, democratic societies, secular governments, gender equality, and international cooperation. Liberalism first became a distinct political movement during the Age of Enlightenment, when it became popular among philosophers and economists in the Western world. Liberalism rejected the prevailing social and political norms of hereditary privilege, state religion, absolute monarchy, and the Divine Right of Kings. The 17th-century philosopher John Locke is often credited with founding liberalism as a distinct philosophical tradition. Locke argued that each man has a natural right to life, liberty, and property, while adding that governments must not violate these rights based on the social contract. Liberals opposed traditional conservatism and sought to replace absolutism in government with representative democracy and the rule of law. Prominent revolutionaries in the Glorious Revolution, the American Revolution, and the French Revolution used liberal philosophy to justify the armed overthrow of what they saw as tyrannical rule. Liberalism started to spread rapidly especially after the French Revolution. The 19th century saw liberal governments established in nations across Europe, South America, and North America. In this period, the dominant ideological opponent of classical liberalism was conservatism, but liberalism later survived major ideological challenges from new opponents, such as fascism and communism. During the 20th century, liberal ideas spread even further as liberal democracies found themselves on the winning side in …
in scheme: political affiliation

libertarian
in dataset: The CWRC Ontology
type: political affiliation
type: Concept
value: religious libertarian
comment: La description de ce terme est basée sur celle de DBPedia. @fr
comment: The description for this term is indebted to DBpedia.
label: Libertarianism
label: Libertarianisme @fr
definition: "Le libertarianisme, aussi appelé libertarisme (à ne pas confondre avec libertarisme de gauche et Libertaire) est une philosophie politique qui conçoit la société juste comme une société dont les institutions respectent et protègent la liberté de chaque individu d’exercer son plein droit de propriété sur lui-même et les droits de propriété qu’il a légitimement acquis sur des objets extérieurs. Issue du libéralisme elle prône donc, au sein d'un système de propriété et de marché universel, la liberté individuelle en tant que droit naturel. La liberté est conçue par le libertarianisme comme une valeur fondamentale des rapports sociaux, des échanges économiques et du système politique. Les libertariens se fondent sur le principe de non-agression qui affirme que nul ne peut prendre l'initiative de la force physique contre un individu, sa personne, sa liberté ou sa propriété. De fait, ses partisans, les libertariens, sont favorables à une réduction voire à la disparition de l'État (antiétatisme) en tant que système fondé sur la coercition, au profit d'une coopération libre et volontaire entre les individus, avec un État limité à des fonctions régaliennes. Robert Nozick (1938-2002), Murray Rothbard (1926-1995) et Charles Murray (1943-) font partie des principaux auteurs nourrissant cette doctrine." (DBpedia, 2017) @fr
definition: "Libertarianism (Latin: liber, "free") is a collection of political philosophies that uphold liberty. Libertarians seek to maximize autonomy and freedom of choice, emphasising political freedom, voluntary association, and the primacy of individual judgment. Libertarians generally share a skepticism of authority; however, they diverge on the scope of their opposition to existing political and economic systems. Various schools of libertarian thought offer a range of views regarding the legitimate functions of state and private power, often calling to restrict or to dissolve coercive social institutions. Some libertarians advocate laissez-faire capitalism and strong private property rights, such as in land, infrastructure, and natural resources. Others, notably libertarian socialists, seek to abolish capitalism and private ownership of the means of production in favor of their common or cooperative ownership and management. An additional line of division is between minarchists and anarchists. While minarchists think that a minimal centralized government is necessary, anarchists propose to completely eliminate the state." (DBpedia, 2017)
in scheme: political affiliation

has literal form
in dataset: The CWRC Ontology
type: ObjectProperty
type: Concept
label: a une forme litteralle @fr
range: textual label

Lollards
is replaced by: Lollardy
in dataset: The CWRC Ontology
type: Concept
comment: Deprecated in favour of instance Lollardy.
comment: Désapprouver en faveur de l'instance Lollardy. @fr
comment: La description de ce terme est basée sur celle de DBPedia. @fr
deprecated: true
term status: deprecated
broader transitive: Roman Catholic
definition: "Les Lollards sont les membres ou sympathisants d'un mouvement de contestation religieuse et sociale apparu en Angleterre au XIVe siècle. — John Ball" (DBpedia, 2017) @fr
definition: "Lollardy (Lollardry, Lollardism) was a political and religious movement that existed from the mid-14th century to the English Reformation. It was initially led by John Wycliffe, a prominent theologian who was dismissed from the University of Oxford in 1381 for criticism of the Church, especially in his doctrine on the Eucharist. The Lollards' demands were primarily for reform of Western Christianity." (DBpedia, 2017)
in scheme: religion

Lollardy
in dataset: The CWRC Ontology
type: religion
type: Concept
comment: La description de ce terme est basée sur celle de DBPedia. @fr
comment: The description for this term is indebted to DBpedia.
broader transitive: Roman Catholicism
definition: "Les Lollards sont les membres ou sympathisants d'un mouvement de contestation religieuse et sociale apparu en Angleterre au XIVe siècle. — John Ball" (DBpedia, 2017) @fr
definition: "Lollardy (Lollardry, Lollardism) was a political and religious movement that existed from the mid-14th century to the English Reformation. It was initially led by John Wycliffe, a prominent theologian who was dismissed from the University of Oxford in 1381 for criticism of the Church, especially in his doctrine on the Eucharist. The Lollards' demands were primarily for reform of Western Christianity." (DBpedia, 2017)
in scheme: religion

lower-middle class
in dataset: The CWRC Ontology
type: social class
type: Concept
label: classe-moyenne inférieure @fr
definition: Cette classe inclut "les employés/es, les travailleurs/euses du clergé, les instituteurs/trices et les gouvernantes. Notez toutefois que certains instituteurs/trices étaient considérés comme Professionnel (Mr. Chips)", de même que les femmes qui ouvrent et dirigent des écoles. @fr
definition: Employees, clerical workers, teachers, governesses. Note, however, that some teachers go into Professions (Mr. Chips from the 1939 film of that name) and women starting schools and then managing them also go into Professions.
in scheme: social class

male
in dataset: The CWRC Ontology
type: textual label
comment: Deprecated with no current equivalence.
comment: Désapprouver sans équivalence. @fr
deprecated: true
one of: man/male
one of: Male
term status: deprecated
in scheme: textual label
name: Male (Label)

Male
is replaced by: man/male
in dataset: The CWRC Ontology
type: Thing
type: Concept
comment: Deprecated in favour of instance man/male.
comment: Désapprouver en faveur de l'instance homme/mâle. @fr
label: Mâle @fr
deprecated: true
term status: deprecated
name: Male (Sex)

man
in dataset: The CWRC Ontology
type: gender
type: Thing
type: Concept
label: homme @fr
broader: manlabel
definition: Indicates identification with or labelling as the gender man, and who is often but not necessarily understood to be sexed male.
definition: Indique l’identification ou l’assignation au genre masculin, et qui est souvent mais non nécessairement de sexe masculin. @fr
in scheme: gender
name: man (gender)

man
in dataset: The CWRC Ontology
has literal form: homme @fr
has literal form: man
type: textual label
type: Concept
label: homme @fr
one of: man
one of: cisman
one of: transman/transmale
definition: A subclass of textual label, this discursive label reflects the ambiguity of manhood, masculinity, or maleness as associated with different cultural forms. It provides a means of aggregating and searching multiple instances of "man" (e.g. man, cisman) cultural identities.
in scheme: textual label
name: Man (Label)

managerial
in dataset: The CWRC Ontology
type: social class
type: Concept
label: cadre @fr
definition: Cette classe réfère à ceux dont «la situation sociale est dûe à l’administration d’une structure dans laquelle ils n’investissent pas leurs propres fonds, par exemple les salariés du service civique, les banquiers, les administrateurs d’hôpitaux.» @fr
definition: This class refers to those whose "station in life comes from the fact that they are running something but not putting their money into it, for instance salaried civil service, bankers, or hospital administrators." (brown_orlando, 2006)
in scheme: social class

chinese communism
in dataset: The CWRC Ontology
type: political affiliation
type: Concept
comment: La description de ce terme est basée sur celle de DBPedia. @fr
comment: The description for this term is indebted to DBpedia.
label: Maoism
label: Maoïsme @fr
definition: "Le maoïsme (en chinois : 毛泽东思想, pinyin : Máo Zédōng sīxiǎng, «pensée Mao-Zedong») est un courant du communisme développé au XXe siècle par Mao Zedong, chef du Parti communiste chinois, qui arrive au pouvoir en Chine en 1949, au terme d'une longue guerre civile contre le Guomindang. Comme Lénine dit avoir adapté les théories de Karl Marx à la Russie, Mao déclare adapter les théories de Marx et de Lénine à la situation politique et économique de la Chine du XXe siècle. Au sortir de la Seconde Guerre mondiale, Mao affirme vouloir émanciper la population chinoise à la fois de l'impérialisme occidental et du confucianisme. Au moment de la rupture sino-soviétique, Mao se réclame d'une lecture «anti-révisionniste» du marxisme-léninisme et refuse de suivre un processus parallèle à la déstalinisation, poussant la Chine encore plus loin sur la voie du quadrillage total de la société par le Parti et du culte de sa personnalité. Le maoïsme, même si la tendance pro-soviétique reste largement majoritaire au sein du communisme mondial, commence alors à la concurrencer, et de multiples groupes à travers le monde se réclament de Mao et de sa vision tiers-mondiste et «anti-impérialiste». L'Albanie d'Enver Hoxha devient même un pays satellite de la Chine. Après la mort de Mao en 1976, le maoïsme est, en République populaire de Chine, progressivement vidé de sa substance idéologique même si le PCC continue de se réclamer officiellement de la «pensée Mao-Zedong». En revanche, des groupes maoïstes, d'importance très inégale, continuent d'exister à travers le monde, notamment des groupes armés de l'Inde, du Népal et d'Amérique latine. En Occident, le maoïsme intellectuel a fait long feu, ses adeptes (dont le philosophe Jean-Paul Sartre) ayant dans leur immense majorité changé d'opinions après la mort de Mao ; il est considéré par les historiens d'aujourd'hui comme une idéologie totalitaire comparable au stalinisme." (DBpedia, 2017) @fr
definition: "Mao Zedong Thought (simplified Chinese: 毛泽东思想; traditional Chinese: 毛澤東思想; pinyin: Máo Zédōng Sīxiǎng), or Maoism, is a political theory derived from the teachings of the Chinese political leader Mao Zedong (1893–1976). Its followers, known as Maoists, consider it an anti-Revisionist form of Marxism–Leninism. Developed from the 1950s until the Deng Xiaoping reforms in the 1970s, it was widely applied as the guiding political and military ideology of the Communist Party of China (CPC), and as theory guiding revolutionary movements around the world. The essential difference between Maoism and other forms of Marxism is that Mao claimed that peasants should be the essential revolutionary class in China, because, contrary to their industrial working "comrades," they were more suited to establishing a successful revolution and socialist society in China." (DBpedia, 2017)
in scheme: political affiliation

custody rights
in dataset: The CWRC Ontology
type: political affiliation
type: Concept
value: divorce reform activist
value: divorce reformer
value: marriage law reformer
value: marriage reformer
value: married women's property supporter
value: maternal wage activist
comment: The description for this term is indebted to DBpedia.
label: marriage law reform
label: réforme du mariage @fr
broader transitive: progressivism
definition: Advocacy or activism related to the reform of laws related to marriage and divorce, including education, marital rape, wages for housework and childrearing, property law, child custody, and civil rights.
definition: Militantisme ou activisme lié aux réformes des lois concernant le mariage et le divorce, comprenant l'éducation, le viol conjugal, la répartition des tâches domestiques et de l'éducation des enfants, la propriété, la garde des enfants et les droits civiques. @fr
in scheme: political affiliation

marxist
in dataset: The CWRC Ontology
type: political affiliation
type: Concept
comment: La description de ce terme est basée sur celle de DBPedia. @fr
comment: The description for this term is indebted to DBpedia.
label: Marxism
label: Marxisme @fr
definition: "Le marxisme est un courant de pensée politique, sociologique et économique fondé sur les idées de Karl Marx (et dans une moindre mesure de Friedrich Engels) et de ses continuateurs. Politiquement, le marxisme repose sur la participation au mouvement réel de la lutte des classes, afin d'arriver à une société sans classes en tant qu'alternative au capitalisme. En effet, Karl Marx considère que «l’émancipation des travailleurs doit être l’œuvre des travailleurs eux-mêmes»." (DBpedia, 2017) @fr
definition: "Marxism is a method of socioeconomic analysis that analyzes class relations and societal conflict using a materialist interpretation of historical development and a dialectical view of social transformation. It originates from the mid-to-late 19th century works of German philosophers Karl Marx and Friedrich Engels. Marxist methodology originally used a method of economic and sociopolitical inquiry known as historical materialism to analyze and critique the development of capitalism and the role of class struggle in systemic economic change. According to Marxist perspective, class conflict within capitalism arises due to intensifying contradictions between the highly productive mechanized and socialized production performed by the proletariat, and the private ownership and appropriation of the surplus product (profit) by a small minority of the population who are private owners called the bourgeoisie. As the contradiction becomes apparent to the proletariat through the alienation of labor, social unrest between the two antagonistic classes will intensify, until it culminates in social revolution. The eventual long-term outcome of this revolution would be the establishment of socialism – a socioeconomic system based on social ownership of the means of production, distribution based on one's contribution, and production organized directly for use. As the productive forces and technology continued to advance, Marx hypothesized that socialism would eventually give way to a communist stage of social development, which would be a classless, stateless, humane society erected on common ownership and the principle of "From each according to his ability, to each according to his needs". Marxism has since developed into different branches and schools of thought, and there is now no single definitive Marxist theory. Different Marxian schools place a greater emphasis on certain aspects of classical Marxism while de-emphasising or rejecting other aspects, and sometimes combine Ma…
in scheme: political affiliation
related: pro-revolutionary

Methodism
in dataset: The CWRC Ontology
type: religion
type: Concept
label: Église méthodiste @fr
broader transitive: Dissent (Protestant)
definition: "Or United Methodists, an English Nonconformist community formed in 1907 by the union of the Methodist New Connexion (1797), the Bible Christians (1815), and the United Methodist Free Churches (1857). The act of parliament which enabled this amalgamation received the royal assent on the 26th of July 1907, and authorized the union "to deal with real and personal property belonging to the said three churches or denominations, to provide for the vesting of the said property in trust for the United Church so formed and for the assimilation of the trusts thereof, and for other purposes." The union was completed on the 16th of September 1907 in Wesley's Chapel, City Road, London." (Encyclopedia Britannica, 1911)
in scheme: religion

Millenarianism
in dataset: The CWRC Ontology
type: religion
type: Concept
type: Organization
comment: La description de ce terme est basée sur celle de DBPedia. @fr
comment: The description for this term is indebted to DBpedia.
label: millénarisme, ou chiliasme @fr
definition: "Le millénarisme, ou chiliasme (ou encore, mais de façon erronée, chialisme), est une doctrine religieuse qui soutient l'idée d'un règne terrestre du Messie, après que celui-ci aura chassé l'Antéchrist et préalablement au Jugement dernier.Cette pensée est présente dans certains courants du judaïsme, dans l'Apocalypse de Jean, dans les écrits des Pères apostoliques et dans l'islam sunnite et chiite.Toujours par extension, le mot peut servir à désigner dans le langage courant des types de pensée non plus religieuses mais politiques." (DBpedia, 2017) @fr
definition: "Millenarianism (also millenarism), from Latin mīllēnārius "containing a thousand", is the belief by a religious, social, or political group or movement in a coming major transformation of society, after which all things will be changed. Millenarianism is a concept or theme that exists in many cultures and religions." (DBpedia, 2017)
in scheme: religion

coloured (mixed-race)
in dataset: The CWRC Ontology
type: race or colour
type: Concept
value: mixed
value: mixed-blood
value: mixed-race
value: racially mixed
value: red mulatto
label: métis @fr
broader: SkinColorSimpleWhite
broader: white identity
definition: "Multiracial is defined as made up of or relating to people of many races. Many terms exist for people of various multiracial backgrounds. While some of the terms used in the past are considered insulting and offensive, there are many socially acceptable modern terms that multiracial people identify with. These include mixed-race, biracial, multiracial, métis, mestizo, pardo and mixed. Individuals of multiracial backgrounds make up a significant portion of the population in many parts of the world. In North America, studies have found that the multiracial population is continuing to grow. Because of a decline in racial discrimination, multiracial people no longer feel the need to hide their heritage. In many countries of Latin America and the Caribbean, mixed-race people make up the majority of the population. Other areas where multiracial people make up a sizable portion of the population are the United Kingdom, the Middle East, parts of Africa and Asia, New Zealand, and Fiji." (DBpedia, 2017)
definition: «Le terme métis (du mot latin mixtīcius ou mixtus qui signifie «mélangé»/«mêlé») est employé, dans le langage courant, pour désigner des personnes nées de parents aux origines géographiques ou aux phénotypes différents. Le métissage humain est appelé créolisation aux Antilles, à La Réunion, à l'île Maurice, en Guyane ou au Brésil. Le métissage peut être aussi entendu comme un processus culturel (linguistique, artistique…). La pertinence analytique de la notion est contestée par des chercheurs en sciences sociales car elle supposerait qu'il existe des «entités pures», ou des races, distinctes au sein de l'espèce humaine.«Au Canada,»Métis (avec majuscule) désigne un peuple autochtone habitant principalement le centre du pays, descendant des femmes cries, ojibwés, saulteaux et de colons pour la plupart français.» (Wikipedia, 2017) @fr
in scheme: race or colour

monarchist
in dataset: The CWRC Ontology
type: political affiliation
type: Concept
value: royalist
comment: La description de ce terme est basée sur celle de DBPedia. @fr
comment: The description for this term is indebted to DBpedia.
label: Monarchisme @fr
label: monarchism
definition: "Le monarchisme est une doctrine politique qui prône la monarchie, c’est-à-dire une forme de gouvernement dans laquelle une seule personne fonde l'autorité de l'État. Le mode de désignation du monarque n'est pas nécessairement héréditaire : il peut dans de rares cas être élu, comme les empereurs du Saint-Empire romain germanique, les doges de la République de Venise ou (encore actuellement) les Papes de l'Église catholique romaine. Cependant, les mots monarque et monarchisme sont presque toujours utilisés à la place de ceux de roi et royalisme, en particulier dans les textes de ceux qui critiquaient la royauté sous l'Ancien Régime. On parle aussi, avec le présidentialisme, de monarchie républicaine." (DBpedia, 2017) @fr
definition: "Monarchism is the advocacy of a monarch or monarchical rule. A monarchist is an individual who supports this form of government, independent of any specific monarch; one who espouses a particular monarch is a royalist. Conversely, the opposition to monarchical rule is sometimes referred to as republicanism. Depending on the country, a monarchist may advocate for the rule of the person who sits on the throne, a pretender, or someone who would otherwise occupy the throne but has been deposed." (DBpedia, 2017)
in scheme: political affiliation

MOTHER
in dataset: The CWRC Ontology
type: ObjectProperty
label: mother of
label: mère de @fr
sub property of: PARENTS

multiculturalist
in dataset: The CWRC Ontology
type: political affiliation
type: Concept
comment: La description de ce terme est basée sur celle de DBPedia. @fr
comment: The description for this term is indebted to DBpedia.
label: Multiculturalisme @fr
label: multiculturalism
definition: "Multiculturalism describes the existence, acceptance, and/or promotion of multiple cultural traditions within a single jurisdiction, usually considered in terms of the culture associated with an aboriginal ethnic group and foreigner ethnic groups. This can happen when a jurisdiction is created or expanded by amalgamating areas with two or more different cultures (e.g. French Canada and English Canada) or through immigration from different jurisdictions around the world (e.g. Australia, Canada, United States, United Kingdom, and many other countries). Multicultural ideologies and policies vary widely, ranging from the advocacy of equal respect to the various cultures in a society, to a policy of promoting the maintenance of cultural diversity, to policies in which people of various ethnic and religious groups are addressed by the authorities as defined by the group to which they belong. Multiculturalism that promotes maintaining the distinctiveness of multiple cultures is often contrasted to other settlement policies such as social integration, cultural assimilation, and racial segregation. Multiculturalism has been described as a "salad bowl" and "cultural mosaic". Two different and seemingly inconsistent strategies have developed through different government policies and strategies. The first focuses on interaction and communication between different cultures; this approach is also often known as interculturalism. The second centers on diversity and cultural uniqueness which can sometimes result in intercultural competition over jobs among other things and may lead to ethnic conflict. Cultural isolation can protect the uniqueness of the local culture of a nation or area and also contribute to global cultural diversity. A common aspect of many policies following the second approach is that they avoid presenting any specific ethnic, religious, or cultural community values as central." (DBpedia, 2017)
definition: Le multiculturalisme est un terme sujet à diverses interprétations. Il peut simplement désigner la coexistence de différentes cultures (ethniques, religieuses, etc.) au sein d'un même ensemble (pays, par exemple). Il peut aussi désigner différentes politiques volontaristes : * anti-discriminatoires, visant à assurer un statut social égal aux membres des diverses cultures ; * communautaires, permettant l'existence de statuts (légaux, administratifs…) spécifiques aux membres de telle ou telle communauté culturelle ; * identitaires, visant à favoriser l'expression des particularités des diverses cultures ; * et aujourd’hui le multiculturalisme se" centre sur le thème religieux (pluralisme). Multiculturalisme s’oppose à interculturalisme. Dans une société interculturelle les immigrés ou leurs descendants participent à l’ensemble des activités de la société d’accueil. Une intégration culturelle réussie nécessite l’abandon d’une partie de la culture d’origine qui ne serait pas compatible avec les valeurs de la société d’accueil." (DBpedia, 2017) @fr
in scheme: political affiliation

multi-racialist
in dataset: The CWRC Ontology
type: political affiliation
type: Concept
comment: The description for this term is indebted to DBpedia.
label: multiracialism
label: multiracialisme @fr
definition: "Multiracialism is a concept or ideology that promotes a society composed of various races, while accepting and respecting different cultural backgrounds. It is a society that consists of a diverse mix of people, whether it be relative to their ethnicity, language, culture, religion, or traditions." (DBpedia, 2017)
in scheme: political affiliation

nationalism
in dataset: The CWRC Ontology
type: political affiliation
type: Concept
comment: La description de ce terme est basée sur celle de DBPedia. @fr
comment: The description for this term is indebted to DBpedia.
label: Nationalisme @fr
definition: "Le nationalisme est un principe politique, né à la fin du XVIIIe siècle, tendant à légitimer l'existence d'un État-nation pour chaque peuple (initialement par opposition à la royauté, régime politique qui en France sera ensuite nommé Ancien Régime). Ce principe politique s'est progressivement imposé en Europe au cours du XIXe siècle et au début du XXe siècle. Les historiens ne présentent pas ce nationalisme, en général, comme une idéologie, car il est peu et mal argumenté ou justifié par des intellectuels. Depuis son avènement il est en revanche facilement présenté comme une évidence dans la vie politique et sociale. Ce terme désigne aussi des mouvements politiques déclarant vouloir exalter une nation sous toutes ses formes (État, culture, religion, traditions, préférence nationale pour l'emploi...), par opposition aux autres nations et populations. Cette deuxième variante du mouvement s'est développée à partir de la fin du XIXe siècle, vers 1870 : chauvine et xénophobe, elle trouvait alors ses militants principalement dans la petite bourgeoisie. Le nationalisme apparaît aussi, à partir du milieu du XIXe siècle, comme un sentiment national plus ou moins répandu et exalté au sein de la population d'un pays, et s'invitant (surtout au XXe siècle) au sein de multiples doctrines ou idéologies politiques, allant du communisme (par exemple le concept de Patriotisme anti-impérialiste de Mao Zedong) et du fascisme (concept de Totalitarisme anticapitaliste de Benito Mussolini) jusqu'aux démocraties parlementaires, en passant par la Troisième Internationale léniniste. Ainsi il a souvent servi de justification aux épurations ethniques du XXe siècle, peut-être parce que le sentiment national est devenu «puissamment mobilisateur», comme l'avaient compris dès le printemps des peuples de 1848 certains conseillers de dynasties européennes. On distingue en général trois formes principales de nationalisme, le nationalisme ethnique, ou ethnonationalisme, qui est la forme de nationalis… @fr
definition: "Nationalism is a shared group feeling in the significance of a geographical and sometimes demographic region seeking independence for its culture or ethnicity that holds that group together. This can be expressed as a belief or political ideology that involves an individual identifying with or becoming attached to one's nation. Nationalism involves national identity, by contrast with the related concept of patriotism, which involves the social conditioning and personal behaviours that support a state's decisions and actions. From a political or sociological perspective, there are two main perspectives on the origins and basis of nationalism. One is the primordialist perspective that describes nationalism as a reflection of the ancient and perceived evolutionary tendency of humans to organize into distinct groupings based on an affinity of birth. The other is the modernist perspective that describes nationalism as a recent phenomenon that requires the structural conditions of modern society in order to exist. An alternative perspective to both of these lineages comes out of engaged theory, and argues that while the form of nationalism is modern, the content and subjective reach of nationalism depends upon "primordial" sentiments. There are various definitions for what constitutes a nation, however, which leads to several different strands of nationalism. It can be a belief that citizenship in a state should be limited to one ethnic, cultural, religious, or identity group, or that multinationality in a single state should necessarily comprise the right to express and exercise national identity even by minorities.The adoption of national identity in terms of historical development has commonly been the result of a response by influential groups unsatisfied with traditional identities due to inconsistency between their defined social order and the experience of that social order by its members, resulting in a situation of anomie that nationalists seek to resolve. This …
in scheme: political affiliation
related: patriot

nazi
in dataset: The CWRC Ontology
contrary to: anti-antisemitism
type: political affiliation
type: Concept
value: pro-nazi
comment: La description de ce terme est basée sur celle de DBPedia. @fr
comment: The description for this term is indebted to DBpedia.
label: Nazism
label: Nazisme @fr
definition: "Le national-socialisme (en allemand : Nationalsozialismus), plus couramment désigné en français sous l'abréviation nazisme, est l'idéologie politique du Parti national-socialiste des travailleurs allemands (NSDAP), parti politique d'extrême droite fondé en Allemagne en 1920 et dirigé par Adolf Hitler. Cette idéologie théorise une hiérarchie au sein d'une espèce humaine divisée en «races», au sommet de laquelle elle place la «race aryenne». Le nazisme est le seul type de fascisme incorporant à la fois racisme biologique et antisémitisme. Par extension, le terme nazisme désigne le régime politique inspiré de cette idéologie, dictature totalitaire et expansionniste dirigée par Adolf Hitler de 1933 à 1945 et connue sous les noms de Troisième Reich et d'Allemagne nazie. En tant que sujet de science politique, les définitions du nazisme varient selon les historiens. En particulier, reste ouverte la question de savoir si le nazisme ne fut que l'une des formes du fascisme ou, parce qu'ayant fait du racisme une doctrine d'État, le nazisme doit être considéré comme un phénomène historique unique. En effet, l'antisémitisme officiel du régime nazi, dès 1933, l'élimination des personnes handicapées et la persécution des opposants politiques, des Juifs, des homosexuels, des Roms, etc., se concrétisèrent par la mise en place, dès 1933, des premiers camps de concentration en Allemagne. Cette politique ne fit que s'amplifier du début de la Seconde Guerre mondiale, qui vit la création des camps d’extermination nazis, jusqu'à la défaite militaire du nazisme en 1945. Ainsi près de six millions de personnes, dont une majorité de Juifs, périrent dans les camps de concentration et d'extermination nazi ou par la Shoah par balles (voir Shoah). Le régime nazi, censé «durer mille ans», en dura douze et laissa l'Allemagne en ruine." (DBpedia, 2017) @fr
definition: "National Socialism (German: Nationalsozialismus), more commonly known as Nazism (/ˈnɑːtsɪzəm, ˈnæ-/), is the ideology and practice associated with the 20th-century German Nazi Party and Nazi state, as well as other far-right groups. Usually characterized as a form of fascism that incorporates scientific racism and antisemitism, Nazism developed out of the influences of Pan-Germanism, the Völkisch German nationalist movement and the anti-communist Freikorps paramilitary groups that emerged during the Weimar Republic after German defeat in World War I. Nazism subscribed to theories of racial hierarchy and Social Darwinism, identifying Germans as part of what Nazis regarded as an Aryan or Nordic master race. It aimed to overcome social divisions and create a homogeneous society, unified on the basis of "racial purity" (Volksgemeinschaft). The Nazis aimed to unite all Germans living in historically German territory, as well as gain additional lands for German expansion under the doctrine of Lebensraum, while excluding those deemed either to be community aliens or belonging to an "inferior" race. The term "National Socialism" arose out of attempts to create a nationalist redefinition of "socialism", as an alternative to both international socialism and free market capitalism. Nazism rejected the Marxist concept of class struggle, opposed cosmopolitan internationalism, and sought to convince all parts of a new German society to subordinate their personal interests to the "common good" and to accept the priority of political interests in economic organisation. The Nazi Party was founded as the Pan-German nationalist and antisemitic German Workers' Party on 5 January 1919. By the early 1920s, Adolf Hitler assumed control of the organisation and renamed it the National Socialist German Workers' Party (Nationalsozialistische Deutsche Arbeiterpartei, NSDAP) to broaden its appeal. The National Socialist Program, adopted in 1920, called for a united Greater Germany that would d…
in scheme: political affiliation
related: anti-semitism
related: fascist

neo-conservatism
in dataset: The CWRC Ontology
type: political affiliation
type: Concept
comment: La description de ce terme est basée sur celle de DBPedia. @fr
comment: The description for this term is indebted to DBpedia.
label: Néo-conservatisme @fr
broader transitive: conservative
definition: "Le néo-conservatisme ou néoconservatisme est un courant de pensée politique d'origine américaine apparu à la fin du XXe siècle. Il s'agit d'une conception qui a émergé aux États-Unis par opposition au relativisme culturel et à la contre-culture de la Nouvelle gauche («New Left») des années 1960. Cette philosophie a influencé les politiques menées par George W. Bush, signifiant un réalignement de la politique américaine, et le passage de quelques libéraux sociaux à la droite du spectre politique, d'où le terme qui fait référence aux «nouveaux» conservateurs. À l'origine, le terme néo-conservateur était utilisé pour critiquer les sociaux-libéraux qui sont passés du côté du Parti républicain. Michael Harrington, un social-démocrate, a forgé l'usage du mot néo-conservateur en 1973 dans Dissent, un magazine sur les politiques de protection sociale. Selon E. J. Dionne, le néo-conservatisme est né sur le principe que le social-libéralisme a échoué. Le premier théoricien néo-conservateur à avoir adopté ce mot et qui est considéré comme le fondateur de cette idéologie est Irving Kristol et père de William Kristol, fondateur du think-tank «néo-conservateur» Project for the New American Century. Irving Kristol a été un militant trotskyste actif pendant sa jeunesse et a exposé ses vues néoconservatrices en 1979 dans l'article Confessions of a True, Self-Confessed 'Neoconservative'. Les idées de Kristol sont influentes depuis les années 1950 quand il a cofondé et édité le magazine Encounter. Un autre idéologue de ce mouvement était Norman Podhoretz, éditeur au magazine Commentary de 1960 à 1995. En 1982, Podhoretz se désignait déjà comme un néo-conservateur dans un article du New York Times Magazine intitulé The Neoconservative Anguish over Reagan's Foreign Policy. La doctrine Reagan était considérée comme anticommuniste et en opposition avec l'influence mondiale de l'URSS. Elle était au centre de la politique étrangère américaine jusqu'à la fin de la Guerre froide, un peu avan… @fr
definition: "Neoconservatism (commonly shortened to neocon) is a political movement born in the United States during the 1960s among conservative leaning Democrats who became disenchanted with the party's foreign policy. Many of its adherents became politically famous during the Republican presidential administrations of the 1970s, 1980s, 1990s and 2000s. Neoconservatives peaked in influence during the administration of George W. Bush, when they played a major role in promoting and planning the 2003 invasion of Iraq. Prominent neoconservatives in the George W. Bush administration included Paul Wolfowitz, John Bolton, Elliott Abrams, Richard Perle, and Paul Bremer. Senior officials Vice President Dick Cheney and Secretary of Defense Donald Rumsfeld, while not identifying as neoconservatives, listened closely to neoconservative advisers regarding foreign policy, especially the defense of Israel and the promotion of democracy in the Middle East. The term "neoconservative" refers to those who made the ideological journey from the anti-Stalinist Left to the camp of American conservatism. Neoconservatives typically advocate the promotion of democracy and promotion of American national interest in international affairs, including by means of military force, and are known for espousing disdain for communism and for political radicalism. The movement had its intellectual roots in the Jewish monthly review magazine Commentary, published by the American Jewish Committee. They spoke out against the New Left and in that way helped define the movement. C. Bradley Thompson, a professor at Clemson University, claims that most influential neoconservatives refer explicitly to the theoretical ideas in the philosophy of Leo Strauss (1899–1973),though in doing so they may draw upon meaning that Strauss himself did not endorse." (DBpedia, 2017)
in scheme: political affiliation

Neo-thomism
in dataset: The CWRC Ontology
type: religion
type: Concept
comment: La description de ce terme est basée sur celle de DBPedia. @fr
label: néothomisme @fr
broader transitive: Roman Catholicism
definition: "Neo-Scholasticism (also known as neo-scholastic Thomism or neo-Thomism because of the great influence of the writings of St. Thomas Aquinas on the movement), is a revival and development of medieval scholasticism in Roman Catholic theology and philosophy which began in the second half of the 19th century." (DBpedia, 2017)
definition: "«Courant de pensée philosophico-théologique de type thomiste, développé à partir XIXe siècle pour répondre aux objections posées au christianisme catholique par la modernité."»(DBpedia, 2017) @fr
in scheme: religion

NEPHEW
in dataset: The CWRC Ontology
type: ObjectProperty
label: nephew of
label: neveu de @fr
sub property of: FAMILY

new dealer
in dataset: The CWRC Ontology
type: political affiliation
type: Concept
comment: The description for this term is indebted to DBpedia.
label: défenseur du New Deal @fr
definition: Défenseurs de la politique du New Deal. Voir New Deal — Wikipédia @fr
definition: Supporter of New Deal policies. See New Deal - Wikipedia
in scheme: political affiliation

NIECE
in dataset: The CWRC Ontology
type: ObjectProperty
label: niece of
label: nièce de @fr
sub property of: FAMILY

nihilist
in dataset: The CWRC Ontology
type: political affiliation
type: Concept
comment: La description de ce terme est basée sur celle de DBPedia. @fr
comment: The description for this term is indebted to DBpedia.
label: Nihilisme @fr
label: nihilism
definition: "Le nihilisme (du latin nihil, «rien») est une doctrine ou attitude, fondée sur la négation de toutes valeurs, croyances ou réalités substantielles. Souvent associé au pessimisme ou au scepticisme radical, le nihilisme nie ou émet des doutes, quant aux causalités, intentionnalités et normativités de l'existence. Cette notion est applicable à différents domaines : politique, littéraire, religieux et philosophique. Un mouvement révolutionnaire nihiliste et anarchiste apparut en Russie dans la seconde moitié du XIXe siècle. Il rejetait l'autorité de l'État, de l'Église orthodoxe et de la famille et revendiquait une organisation de la société basée sur le rationalisme et le matérialisme. Il aboutit vers 1870 au terrorisme radical." (DBpedia, 2017) @fr
definition: "Nihilism is a philosophical doctrine that suggests the lack of belief in one or more reputedly meaningful aspects of life. Most commonly, nihilism is presented in the form of existential nihilism, which argues that life is without objective meaning, purpose, or intrinsic value. Moral nihilists assert that morality does not inherently exist, and that any established moral values are abstractly contrived. Nihilism can also take epistemological, ontological, or metaphysical forms, meaning respectively that, in some aspect, knowledge is not possible, or that reality does not actually exist. The term is sometimes used in association with anomie to explain the general mood of despair at a perceived pointlessness of existence that one may develop upon realising there are no necessary norms, rules, or laws. Movements such as Futurism and deconstruction, among others, have been identified by commentators as "nihilistic". Nihilism is also a characteristic that has been ascribed to time periods: for example, Jean Baudrillard and others have called postmodernity a nihilistic epoch, and some Christian theologians and figures of religious authority have asserted that postmodernity and many aspects of modernity represent a rejection of theism, and that such rejection of their theistic doctrine entails nihilism." (DBpedia, 2017)
in scheme: political affiliation

nobility
in dataset: The CWRC Ontology
type: social class
type: Concept
label: noblesse @fr
definition: Ce groupe réfère aux «personnes qui possèdent un titre, ou dont un membre de la famille proche possède un titre (telle que Lady Mary Wortley Montagu, Lord Byron, ou Nancy Mitford)». @fr
definition: This group refers to "those holding a title or of close family relation to someone holding a title (such as Lady Mary Wortley Montagu, Lord Byron, or Nancy Mitford)". (brown_orlando, 2006)
in scheme: social class

nonjurors movement
in dataset: The CWRC Ontology
type: political affiliation
type: Concept
comment: The description for this term is indebted to DBpedia.
label: mouvement du clergé réfractaire @fr
broader transitive: jacobite
definition: "The nonjuring schism was a split in the Anglican churches of England, Scotland and Ireland in the aftermath of the Glorious Revolution of 1688, over whether William III and Mary II could legally be recognised as sovereigns. The word "nonjuring" means "not swearing [an oath]", from the Latin word iuro or juro meaning "to swear an oath". Many of the Anglican clergy felt legally bound by their previous oaths of allegiance to James II and, though they could accept William as regent, they could not accept him as king. It was not necessarily a split on matters of religious doctrine, but more of a political issue and a matter of conscience, though most of the nonjurors were high church Anglicans. Thus, latitudinarian Anglicans were handed control of the Church of England, while Presbyterians took control of the Church of Scotland. The nonjurors thus were nominally Jacobite, although they generally did not actively support the Jacobite rebellions in 1715 or 1745." (DBpedia, 2017)
in scheme: political affiliation

Occultism/Theosophism
in dataset: The CWRC Ontology
type: religion
type: Concept
label: occultisme @fr
definition: "Any religious or philosophic ideology based on mystical insight into the nature of God and/or divine truth. This insight is attained only through direct experience of the divine. The term is sometimes used to specifically refer to the principles of the Theosophical Society founded in New York in 1875 by Madame Blavatsky and H. S. Olcott which incorporated aspects of Buddhism and Brahmanism." (Getty, 2017)
in scheme: religion

Members of the Orlando Project
in dataset: The CWRC Ontology
type: Concept
type: Group
label: Les membres du projet Orlando @fr
definition: La collection de tous les auteurs du Projet Orlando. @fr
definition: The collection of all persons having written entries for The Orlando Project.
name: Members of the Orlando Project.

pacifist
in dataset: The CWRC Ontology
type: political affiliation
type: Concept
value: pacifist supporter
value: peace movement
comment: La description de ce terme est basée sur celle de DBPedia. @fr
comment: The description for this term is indebted to DBpedia.
label: Pacifisme @fr
label: pacifism
definition: "Le pacifisme possède deux acceptions possibles incluant l'action des partisans de la paix, ou une doctrine de la non-violence. Bien que reliés, les deux concepts se distinguent du point de vue de la théorie et de la pratique. Le pacifisme est la doctrine et l'action des partisans de la paix ou du rétablissement de la paix. Les socialistes d'avant 1914 (Jean Jaurès), les Zimmerwaldiens durant la Première Guerre mondiale, les opposants aux guerres coloniales ou les partisans de la paix professent un pacifisme qui n'est pas toujours assimilable à la non-violence. La vision du pacifisme associé à une personne refusant le recours à toutes formes de violence est par contre beaucoup plus répandue. La doctrine de la non-violence voit de nombreux courants philosophiques bannir le recours à toute forme de violence en vertu d'un pacifisme radical. Vision portée par de nombreux mouvements et courants de pensée à vocation générale (courants de pensée humaniste, plusieurs tendances inspirées de l'hindouisme, courants chrétiens, etc.)." (DBpedia, 2017) @fr
definition: "Pacifism is opposition to war, militarism, or violence. The word pacifism was coined by the French peace campaigner Émile Arnaud (1864–1921) and adopted by other peace activists at the tenth Universal Peace Congress in Glasgow in 1901. A related term is ahimsa (to do no harm), which is a core philosophy in Buddhism, Jainism, and Hinduism. While modern connotations are recent, having been explicated since the 19th century, ancient references abound. In Christianity, Jesus Christ's injunction to "love your enemies" and asking for forgiveness for his crucifiers "for they know not what they do" have been interpreted as calling for pacifism. In modern times, interest was revived by Leo Tolstoy in his late works, particularly in The Kingdom of God Is Within You. Mohandas Gandhi (1869–1948) propounded the practice of steadfast nonviolent opposition which he called "satyagraha", instrumental in its role in the Indian Independence Movement. Its effectiveness served as inspiration to Martin Luther King Jr., James Lawson, James Bevel, Thich Nhat Hanh and many others in the Civil Rights Movement. Pacifism was widely associated with the much publicized image of Tiananmen Square Protests of 1989 with the "Tank Man", where one protester stood in nonviolent opposition to a column of tanks." (DBpedia, 2017)
in scheme: political affiliation
related: anti-conscriptionist
related: anti-WarMovement

Pagan
is replaced by: Paganism
in dataset: The CWRC Ontology
type: Concept
comment: Deprecated in favour of instance Paganism.
comment: Désapprouver en faveur de l'instance Paganisme. @fr
label: païen (ou payen) @fr
deprecated: true
term status: deprecated
broader transitive: Occultism/Theosophism
definition: "Paganism is a term that developed among the Christian community of southern Europe during late antiquity to describe religions other than their own, Judaism, or Islam–the three Abrahamic religions. Throughout Christendom, it continued to be used, typically in a derogatory sense. In the 19th century, it was re-adopted as a self-descriptor by members of various artistic groups inspired by the ancient world. In the 20th century, it came to be applied as a self-description by practitioners of contemporary pagan, or neo-pagan, religious movements. There has been much scholarly argument as to the origin of the term paganism. Paganism has also been understood by some[who?] to include any non-Abrahamic religions, but this is generally[who?] seen as insulting by adherents of those religions. While paganism is often considered to exclude monotheism and to express a worldview that is pantheistic, polytheistic, or animistic, there are some monotheistic pagans. Once monotheistic religions, such as Christianity and Islam, started to become more prominent (in processes known as Christianization and Islamization), names to encompass polytheistic worshipers started to develop; some of these include Hellene, pagan, and heathen, and at times these names were used as slurs. Modern knowledge of old pagan religions comes from several sources, including: anthropological field research records, the evidence of archaeological artifacts, and the historical accounts of ancient writers regarding cultures known to the classical world. Before the rise of monotheistic religions, most people practiced some type of polytheism. Many of these religions started to die out, and eventually they became extinct. In some cases, elements of polytheistic belief systems continued to exist in folklore. Paganism would later be studied during the Renaissance and Romantic era. Forms of these religions, influenced by various historical pagan beliefs of pre-modern Europe, exist today and are known as contemporary …
definition: "Paganisme est un terme générique employé depuis le VIe siècle par des chrétiens pour désigner la religion de ceux qui ne sont ni chrétiens, ni juifs, ni musulmans. Il remonte au latin paganus (païen). Au VIe siècle, ce mot pouvait servir à désigner les habitants des campagnes par opposition à ceux des villes ou bien les civils par opposition aux militaires. D'abord employé comme sobriquet populaire par des chrétiens pour désigner ceux qui ne sont pas baptisés, le terme a ensuite été adopté dans la littérature chrétienne. Même s'il y désigne toujours ceux qui ne sont pas chrétiens, son acception y est cependant ambiguë. Il est parfois employé de façon péjorative pour désigner ceux qui sont tenus pour être des ignorants, parfois de façon neutre pour désigner les philosophes grecs, parfois encore pour désigner des chrétiens jugés mal convertis ou tièdes dans leur foi. À partir de 370, des lois impériales regroupées au Ve siècle dans le code théodosien emploient le terme paganus pour désigner ceux qui pratiquent la magie, ceux qui sont considérés comme superstitieux ou dans l'erreur. Le terme a depuis conservé une connotation péjorative. De nombreux Pères de l'Église ayant écrit «contre les païens», le paganisme a eu une première existence sous forme de fiction littéraire, comme s'il s'agissait de la religion de ceux qui ne sont pas chrétiens. Le paganisme tel qu'il a été exposé par les Pères de l'Église n'était cependant pas à proprement parler une religion, il s'agit plutôt de l'ensemble sans homogénéité des positions philosophiques et des croyances rejetées par les Pères de l'Église. Le paganisme est ainsi, dans l'antiquité tardive, une attitude combattue par des chrétiens puis par les autorités, mais elle n'est revendiquée par personne. C'est surtout à l'époque moderne, avec l'essor de l'histoire des religions que le paganisme commence à être perçu et étudié comme une religion parmi d'autres. Le paganisme peut aujourd'hui être revendiqué sous forme de néo-paganisme… @fr
in scheme: religion

Paganism
in dataset: The CWRC Ontology
type: religion
type: Concept
comment: La description de ce terme est basée sur celle de DBPedia. @fr
comment: The description for this term is indebted to DBpedia.
label: Paganisme @fr
definition: "Paganism is a term that developed among the Christian community of southern Europe during late antiquity to describe religions other than their own, Judaism, or Islam–the three Abrahamic religions. Throughout Christendom, it continued to be used, typically in a derogatory sense. In the 19th century, it was re-adopted as a self-descriptor by members of various artistic groups inspired by the ancient world. In the 20th century, it came to be applied as a self-description by practitioners of contemporary pagan, or neo-pagan, religious movements. There has been much scholarly argument as to the origin of the term paganism. Paganism has also been understood by some to include any non-Abrahamic religions, but this is generally[who?] seen as insulting by adherents of those religions. While paganism is often considered to exclude monotheism and to express a worldview that is pantheistic, polytheistic, or animistic, there are some monotheistic pagans. Once monotheistic religions, such as Christianity and Islam, started to become more prominent (in processes known as Christianization and Islamization), names to encompass polytheistic worshipers started to develop; some of these include Hellene, pagan, and heathen, and at times these names were used as slurs. Modern knowledge of old pagan religions comes from several sources, including: anthropological field research records, the evidence of archaeological artifacts, and the historical accounts of ancient writers regarding cultures known to the classical world. Before the rise of monotheistic religions, most people practiced some type of polytheism. Many of these religions started to die out, and eventually they became extinct. In some cases, elements of polytheistic belief systems continued to exist in folklore. Paganism would later be studied during the Renaissance and Romantic era. Forms of these religions, influenced by various historical pagan beliefs of pre-modern Europe, exist today and are known as contemporary or mod…
definition: "Paganisme est un terme générique employé depuis le VIe siècle par des chrétiens pour désigner la religion de ceux qui ne sont ni chrétiens, ni juifs, ni musulmans. Il remonte au latin paganus (païen). Au VIe siècle, ce mot pouvait servir à désigner les habitants des campagnes par opposition à ceux des villes ou bien les civils par opposition aux militaires. D'abord employé comme sobriquet populaire par des chrétiens pour désigner ceux qui ne sont pas baptisés, le terme a ensuite été adopté dans la littérature chrétienne. Même s'il y désigne toujours ceux qui ne sont pas chrétiens, son acception y est cependant ambiguë. Il est parfois employé de façon péjorative pour désigner ceux qui sont tenus pour être des ignorants, parfois de façon neutre pour désigner les philosophes grecs, parfois encore pour désigner des chrétiens jugés mal convertis ou tièdes dans leur foi. À partir de 370, des lois impériales regroupées au Ve siècle dans le code théodosien emploient le terme paganus pour désigner ceux qui pratiquent la magie, ceux qui sont considérés comme superstitieux ou dans l'erreur. Le terme a depuis conservé une connotation péjorative. De nombreux Pères de l'Église ayant écrit «contre les païens», le paganisme a eu une première existence sous forme de fiction littéraire, comme s'il s'agissait de la religion de ceux qui ne sont pas chrétiens. Le paganisme tel qu'il a été exposé par les Pères de l'Église n'était cependant pas à proprement parler une religion, il s'agit plutôt de l'ensemble sans homogénéité des positions philosophiques et des croyances rejetées par les Pères de l'Église. Le paganisme est ainsi, dans l'antiquité tardive, une attitude combattue par des chrétiens puis par les autorités, mais elle n'est revendiquée par personne. C'est surtout à l'époque moderne, avec l'essor de l'histoire des religions que le paganisme commence à être perçu et étudié comme une religion parmi d'autres. Le paganisme peut aujourd'hui être revendiqué sous forme de néo-paganisme… @fr
in scheme: religion

Pantheism
in dataset: The CWRC Ontology
type: religion
type: Concept
comment: La description de ce terme est basée sur celle de DBPedia. @fr
comment: The description for this term is indebted to DBpedia.
label: Panthéisme @fr
definition: "Le panthéisme est une doctrine philosophique selon laquelle Dieu est tout. Elle se distingue du monothéisme en considérant que Dieu n'est pas un être personnel distinct du monde, mais qu'il est l'intégralité du monde, cette conception est appelée l'immanence par opposition au principe de transcendance du Dieu créateur monothéiste. Ce mot vient du grec ancien pan (πὰν) : «tout» et theos (θεός) («dieu»). Il apparaît pour la première fois en 1720 dans le Pantheisticon de John Toland, ou plus tôt chez Joseph Raphson, en 1697 quand il oppose les panthéistes aux athées et aux matérialistes et les définit comme des penseurs qui affirment qu'il existe une seule substance qui est matérielle et intelligente et qui a tout créé de sa propre substance . Dans la philosophie occidentale, et notamment depuis Spinoza, le sens qui est donné à ce mot tout est en général identique à celui associé à la Nature, au sens le plus général de ce terme, autrement dit, de «tout ce qui existe». Le panthéisme est un naturalisme de la divinité de la Nature. Le naturalisme, au sens propre, peut être défini comme une doctrine athée qui ne reconnaît d'autres principes que les lois ou forces de la Nature. Le panthéisme s'identifie ainsi, sous ce rapport, à un naturalisme déiste déterministe en cela qu'il est lié au concept de nécessité. Il ne doit pas être confondu avec le panenthéisme nommé «acosmique» par Hegel (tout est en Dieu) qui est quant une doctrine issue du panthéisme. Il entretient certains rapports avec les courants monistes qui tentent de résoudre les deux termes d'une dualité en faisant sortir l'un des deux termes de cette dualité de l'un des deux termes en opposition".(DBpedia, 2017) @fr
definition: "Pantheism is the belief that all of reality is identical with divinity, or that everything composes an all-encompassing, immanent god. Pantheists thus do not believe in a distinct personal or anthropomorphic god. In the West, pantheism was formalized as a separate theology and philosophy based on the work of the 17th-century philosopher Baruch Spinoza (also known as Benedict Spinoza), whose book Ethics was an answer to Descartes' famous dualist theory that the body and spirit are separate. Although the term pantheism was not coined until after his death, Spinoza is regarded as its most celebrated advocate. His work, Ethics was the major source from which Western pantheism spread. Pantheistic concepts may date back thousands of years, and some religions in the East continue to contain pantheistic elements".(DBpedia, 2017)
in scheme: religion

PARENTS
in dataset: The CWRC Ontology
type: ObjectProperty
label: parent de @fr
label: parent of
sub property of: FAMILY

parliamentarian
in dataset: The CWRC Ontology
type: political affiliation
type: Concept
value: parliamentarianism
value: pro-parliamentarian
comment: The description for this term is indebted to DBpedia.
label: parlementarisme @fr
definition: Advocacy for parliamentary systems in government. See: Parliamentary system - Wikipedia
definition: Plaidoyer pour les systèmes gouvernementaux parlementaires. Voir Régime parlementaire — Wikipédia @fr
in scheme: political affiliation

parliamentary reformer
in dataset: The CWRC Ontology
type: political affiliation
type: Concept
value: pro-reform
comment: The description for this term is indebted to DBpedia.
label: parliamentary reform
label: réforme parlementaire @fr
definition: Défense de la réforme parlementaire au Royaume-Uni. Voir Representation of the People Act 1918 — Wikipédia et Reform Act 1832 — Wikipédia @fr
definition: Support for reform of the parliamentary system of the United Kingdom. See Reform Bills - Wikipedia; Category:Representation of the People Acts - Wikipedia; Electoral reform - Wikipedia
in scheme: political affiliation

PARTNER
in dataset: The CWRC Ontology
type: ObjectProperty
label: conjoint de @fr
label: partner of
sub property of: FAMILY
different from: Partnership
definition: Ce terme représente uniquement les relations affectives, amoureuses ou familiales et non des relations d'affaires. @fr
definition: This term is intended for romantic / emotional / familial relationships and not for business relationships.

patriot
in dataset: The CWRC Ontology
type: political affiliation
type: Concept
value: patriotic
value: patriotism
comment: La description de ce terme est basée sur celle de DBPedia. @fr
comment: The description for this term is indebted to DBpedia.
label: Patriotisme @fr
definition: "Le patriotisme désigne le dévouement d'un individu envers son pays qu'il reconnait comme étant sa patrie." (DBpedia, 2017) @fr
definition: "Patriotism is an emotional attachment to a nation which an individual recognizes as their homeland. This attachment, also known as national feeling or national pride, can be viewed in terms of different features relating to one's own nation, including ethnic, cultural, political, or historical aspects. It encompasses a set of concepts closely related to those of nationalism. An excess of patriotism in the defense of a nation is called chauvinism; another related term is jingoism. The English term patriot is first attested in the Elizabethan era, via Middle French from Late Latin (6th century) patriota, meaning "countryman", ultimately from Greek πατριώτης (patriōtēs), meaning "from the same country", from πατρίς (patris), meaning "fatherland". The abstract noun patriotism appears in the early 18th century." (DBpedia, 2017)
in scheme: political affiliation

persona to
type: ObjectProperty
domain: persona
range: natural person
inverse of: has persona

personal property
in dataset: The CWRC Ontology
type: ObjectProperty
label: propriété personnelle @fr
definition: A property that is ascribed to a person.
definition: Une propriété qui est attribuée à une personne. @fr

personal property (self reported)
is replaced by: personal property self-reported
in dataset: The CWRC Ontology
comment: Deprecated in favour of instance personal property self-reported.
comment: Désapprouver en faveur de l'instance propriété personnelle autodéclarée. @fr
label: propriété de la personne (autodéclarée) @fr
sub property of: personal property
deprecated: true
term status: deprecated

personal property self-reported
in dataset: The CWRC Ontology
type: ObjectProperty
label: propriété personnelle autodéclarée @fr
sub property of: personal property
definition: This is a personal property that is self-reported.
definition: Une propriété personnelle autodéclarée. @fr

Plymouth Brethren
in dataset: The CWRC Ontology
type: religion
type: Concept
comment: La description de ce terme est basée sur celle de DBPedia. @fr
comment: The description for this term is indebted to DBpedia.
label: Assemblées de Frères @fr
label: Frères de Schwarzenau @fr
broader transitive: Dissent (Protestant)
broader transitive: Millenarianism
definition: "Le courant des Assemblées de Frères ou Plymouth Brethren ou encore Frères de Plymouth constitue l'une des branches du protestantisme évangélique. Ce mouvement est né à Dublin et en Grande-Bretagne vers 1830 et a connu une importante scission en 1848 qui a abouti à distinguer un courant «ouvert» d'une part, les «Open Brethren», et un courant «exclusif» d'autre part, appelé aussi «darbyste». La branche la plus «étroite» a suivi John Nelson Darby et la branche plus ouverte des leaders comme George Müller et Henry Craik. Ces deux courants se sont développés dans le monde et notamment en France pour faire partie des cinq principales dénominations évangéliques sur quarante-trois significatives." (DBpedia, 2017) @fr
definition: "The Plymouth Brethren are a conservative, low church, nonconformist, Evangelical Christian movement whose history can be traced to Dublin, Ireland in the late 1820s, originating from Anglicanism. Among other beliefs, the group emphasises sola scriptura, the belief that the Bible is the supreme authority for church doctrine and practice over and above "the [mere] tradition of men" (Mark 7:8). Brethren generally see themselves not as a denomination but as a network, or even as a collection of overlapping networks, of like-minded independent churches. (The Brethren would generally prefer that their gatherings be referred to as "assemblies" rather than "churches" but, in the interests of simplicity, this article uses both terms interchangeably.) The movement refused for many years to take any denominational name to itself, a stance that some still maintain. The title "The Brethren," however, is one that many of their number are comfortable with, in that the Bible designates all believers as "brethren". ("[O]ne is your Master, even Christ; and all ye are brethren." Matthew 23:8)" (DBpedia, 2017)
in scheme: religion

Polish nationalism
in dataset: The CWRC Ontology
type: political affiliation
type: Concept
value: polish nationalist
comment: The description for this term is indebted to DBpedia.
label: nationalisme polonais @fr
broader transitive: nationalism
definition: "Polish nationalism is the nationalism that asserts that Poles are a Polish nation, and promotes the cultural unity of Poles. Norman Davies, in the context of Polish nationalism, defined nationalism in general as "a doctrine ... to create a nation by arousing people's awareness of their nationality, and to mobilize their feelings into a vehicle for political action". The old Polish protonationalism of the Polish-Lithuanian Commonwealth based on the Polish-Lithuanian identity was multi-ethnic and multi-religious. The nationalist ideology developed soon after the Partitions was initially free of "ethnic nationalism" of any kind. It was a Romantic movement for the restoration of the Polish sovereign state. Polish Romantic nationalism was described by Maurycy Mochnacki as "the essence of the nation" no longer defined by borders but by ideas, feelings, and thoughts resulting from the past. The birth of modern nationalism under foreign rule coincided with the November Uprising of 1830 and the subsequent Spring of Nations. However, the defeat suffered by the Poles also broke the Polish revolutionary spirit. Many intellectuals turned to social Darwinism of Herbert Spencer, blaming the Romantic philosophy for the loss of their property, mass destruction, and ultimately the loss of the nation. With the advent of Positivism between 1860 and 1890 Polish nationalism became an elitist cause. Because the partitioning powers could not have identified themselves with the Polish nation, therefore the ideology became more restrictive in terms of ethnicity and religion." (DBpedia, 2017)
in scheme: political affiliation

advocate for the poor
in dataset: The CWRC Ontology
type: political affiliation
type: Concept
comment: The description for this term is indebted to DBpedia.
label: défense des pauvres @fr
label: poor advocacy
broader transitive: progressivism
definition: Advocacy for the poor.
definition: Militantisme en faveur des pauvres. @fr
in scheme: political affiliation

Poor Law reform
in dataset: The CWRC Ontology
type: political affiliation
type: Concept
comment: The description for this term is indebted to DBpedia.
label: poor law reform
label: réforme de la Poor Law @fr
broader transitive: progressivism
definition: "From the reign of Elizabeth I until the passage of the Poor Law Amendment Act in 1834 relief of the poor in England was administered on the basis of a Poor Law enacted in 1601. From the start of the nineteenth century the basic concept of providing poor relief was criticised as misguided by leading political economists and in southern agricultural counties the burden of poor-rates was felt to be excessive (especially where poor-rates were used to supplement low wages (the "allowance" or Speenhamland system)). Opposition to the Elizabethan Poor Law led to a Royal Commission on poor relief, which recommended that poor relief could not in the short term be abolished; however it should be curtailed, and administered on such terms that none but the desperate would claim it. Relief should only be administered in workhouses, whose inhabitants were to be confined, "classified" (men, women, boys, girls) and segregated. The Poor Law Amendment Act allowed these changes to be implemented by a Poor Law Commission largely unaccountable to Parliament. The Act was passed by large majorities in Parliament, but the regime it was intended to bring about was denounced by its critics as (variously) un-Christian, un-English, unconstitutional, and impracticable for the great manufacturing districts of Northern England. The Act itself did not introduce the regime, but introduced a framework by which it might easily be brought in. Opposition to the New Poor Law strictly speaking was resistance to the introduction of the New Poor Law administrative framework; this was chiefly encountered in the industrial North in 1837–9 and overcome after a few riots by a judicious mixture of legal threats and deployment of the military. Opposition to the New Poor Law in the looser sense of resistance to (and criticism of) key features of the regime recommended by the Royal Commission persisted and eventually became orthodoxy: for example outdoor relief was never abolished in much of the industrial North. …
in scheme: political affiliation

Presbyterianism
in dataset: The CWRC Ontology
type: religion
type: Concept
comment: La description de ce terme est basée sur celle de DBPedia. @fr
comment: The description for this term is indebted to the Getty Art & Architecture Thesaurus.
label: Prebyteriaan @nl
label: Presbiterianismo @es
label: Presbytarianisme @fr
label: Presbyterianisme @nl
label: chang lao tsung @zh-latn
label: zhang lao zong @zh-latn
label: zhǎng lǎo zōng @zh-latn
label: 長老制 @zh-hant
label: 長老宗 @zh-hant
label: 長老教會 @zh-hant
broader transitive: Dissent (Protestant)
definition: "Een van de belangrijkste protestantse groeperingen die voortkwamen uit de 16de-eeuwse Reformatie. In het algemeen hebben moderne presbyteriaanse kerken hun oorsprong in de calvinistische kerken op de Britse eilanden, waarvan de Europese tegenhangers bekend zijn geworden onder de meer algemene naam 'gereformeerden'. De term 'presbyteriaans' verwijst ook naar een collegiaal type kerkbestuur onder leiding van pastors en leken die ouderlingen of presbyters worden genoemd. Strikt genomen maken alle presbyteriaanse kerken deel uit van de gereformeerde of calvinistische traditie, maar zijn niet alle gereformeerde kerken presbyteriaans in hun bestuursvorm." (Getty, 2017) @nl
definition: "Le presbytérianisme est une forme du protestantisme liée à l'Écosse." (DBpedia, 2017) @fr
definition: "One of the main Protestant groups that arose out of the 16th-century Reformation. Generally speaking, modern Presbyterian churches trace their origins to the Calvinist churches of the British Isles, the European counterparts of which came to be known by the more inclusive name of Reformed. The term presbyterian also denotes a collegiate type of church government led by pastors and lay leaders called elders or presbyters. Strictly speaking, all Presbyterian churches are a part of the Reformed, or Calvinist, tradition, although not all Reformed churches are presbyterian in their form of government." (Getty, 2017)
definition: "Uno de los principales grupos protestantes que surgió de la Reforma del siglo XVI. Hablando en general, las Iglesias Presbiterianas modernas señalan sus orígenes en las iglesias calvinistas de las Islas Británicas, la contraparte Europea la que fue conocida por el nombre más global de "Reformada". El término presbiterianismo también denota un tipo colegiado de gobierno de iglesia liderado por el pastor y lideres laicos llamados ancianos o presbiteros. Estrictamente hablando, todas las iglesias presbiterianas son parte de la Iglesia .El término presbiterianismo también denota un tipo colegiado de gobierno de iglesia liderado por el pastor y lideres laicos llamados ancianos o presbiteros. Estrictamente hablando, todas las iglesias presbiterianas son parte de la Reforma o Calvinismo, tradición, aunque no todas las iglesias Reformadas son presbiterianas en su gubernamentalidad." (Getty, 2017) @es
definition: "自十六世紀宗教改革興起的主要新教團體的一派。一般說來，現代的長老教會可追溯至不列顛群島的喀爾文(Calvinis)教派，其在歐洲的對應教派則被稱為較具涵蓋性的歸正派(Reformed)。長老教會一詞，亦表示其管理方式如同大學，由稱作長老或教士的牧師及信徒領導。嚴格來說，所有長老教會皆為歸正派或喀爾文教派傳統的一部分，但並非所有歸正教會的管理方式皆如同長老教會一般。" (Getty, 2017) @zh-hant
in scheme: religion

prison reform
in dataset: The CWRC Ontology
type: political affiliation
type: Concept
comment: The description for this term is indebted to DBpedia.
label: réforme pénitentiaire @fr
broader transitive: progressivism
definition: "Prison reform is the attempt to improve conditions inside prisons, establish a more effective penal system, or implement alternatives to incarceration." (DBpedia, 2017)
in scheme: political affiliation

pro-American
in dataset: The CWRC Ontology
type: political affiliation
type: Concept
label: pro-américain @fr
definition: A pro-American or "Americanophile" stance favours the policies, actions, or culture of the United States of America.
in scheme: political affiliation
related: nationalism

pro-Boer War
in dataset: The CWRC Ontology
type: political affiliation
type: Concept
comment: The description for this term is indebted to DBpedia.
label: pro-guerre des Boers @fr
definition: Défenseurs de la première ou de la seconde guerre des Boers. Voir Première guerre des Boers — Wikipédia et Seconde guerre des Boers — Wikipédia @fr
definition: Support of the First or Second Boer War. See First Boer War - Wikipedia; Second Boer War - Wikipedia
in scheme: political affiliation

catholic
in dataset: The CWRC Ontology
type: political affiliation
type: Concept
value: non-compounder
value: roman catholic
comment: The description for this term is indebted to DBpedia.
label: pro-Catholicism
label: procatholicisme @fr
definition: Favouring the political re-establishment of Catholicism as a component of the state or the extension of civil rights to Catholics. See Category:Catholicism-related controversies - Wikipedia
definition: Lutte en faveur de la réintégration du catholicisme au sein de l'État ou de l'extension des droits civiques des catholiques. Voir Catégorie:Controverse en religion — Wikipédia @fr
in scheme: political affiliation
related: Roman Catholicism

pro-choice
in dataset: The CWRC Ontology
type: political affiliation
type: Concept
comment: La description de ce terme est basée sur celle de DBPedia. @fr
comment: The description for this term is indebted to DBpedia.
label: Mouvement pro-choix @fr
definition: " Pour l’article homonyme, voir ProChoix. Le mouvement pro-choix (en anglais pro-choice, c'est-à-dire «pour le choix») désigne en Amérique du Nord l'ensemble des mouvements qui défendent l'idée politique et éthique que les femmes devraient avoir le contrôle de leur grossesse et de leur fertilité. S'y ajoutent notamment la liberté sexuelle, le droit au recours à l'avortement légal et encadré, et le libre choix de la contraception. On l'oppose dans ce contexte aux mouvements pro-vie, pour lesquels la liberté des femmes ne peut pas être utilisée comme argument pour contester le droit à la vie de l'embryon. Par extension, on utilise pro-choix pour évoquer tous les mouvements de défense des libertés individuelles, telles que la liberté de culte et l'euthanasie. Ce terme provient d'une justification des actes en fonction de leurs modalités d'exécution (choisi/imposé)." (DBpedia, 2017) @fr
definition: "Abortion-rights movements advocate for legal access to induced abortion services. The issue of induced abortion remains divisive in public life, with recurring arguments to liberalize or to restrict access to legal abortion services. Abortion-rights supporters themselves are frequently divided as to the types of abortion services that should be available and to the circumstances, for example different periods in the pregnancy such as late term abortions, in which access may be restricted." (DBpedia, 2017)
in scheme: political affiliation
related: activist for women and children

pro-European
in dataset: The CWRC Ontology
type: political affiliation
type: Concept
comment: The description for this term is indebted to DBpedia.
label: europhile @fr
definition: Défense de l'existence, des lois et de l'influence de l'Union Européenne. Voir Europhilie — Wikipédia @fr
definition: Supportive of the existence, policies, or influence of the European Union. See Pro-Europeanism - Wikipedia
in scheme: political affiliation

pro-slavery
in dataset: The CWRC Ontology
contrary to: anti-racist
contrary to: anti-segregationist
type: political affiliation
type: Concept
comment: The description for this term is indebted to DBpedia.
label: pro-esclavagisme @fr
broader transitive: racist
definition: "Proslavery is an ideology that perceives slavery as a positive good." (DBpedia, 2017)
in scheme: political affiliation

professional
in dataset: The CWRC Ontology
type: social class
type: Concept
label: professionelle @fr
definition: Doctors, lawyers, guild members, and those of high calling such as members of the clergy (Church of England) belong to this class. It implies social respect and intellectual requirements. Examples are Ann Hunter, who was married to a surgeon, and Virginia Woolf, daughter of an intellectual. (brown_orlando, 2006)
definition: Les docteur/res, avocat/es, membres de guilde, et les hautes appellations comme les membres du clergé (Église d’Angleterre) appartiennent à cette classe. Ces professions sont respectées socialement et requièrent des qualités intellectuelles. Ann Hunter, mariée à un chirurgien, et Virginia Woolf, fille d’intellectuel, en sont des exemples. @fr
in scheme: social class
note: Overlaps with the class.

illegitimacy reformer
in dataset: The CWRC Ontology
type: political affiliation
type: Concept
value: land reform
value: land reformer
value: property reform
comment: The description for this term is indebted to DBpedia.
label: property law reform
label: réforme des droits à la propriété @fr
definition: Défense des réformes législatives sur les biens fonciers et immobiliers. Voir Droit des biens en France — Wikipédia @fr
definition: Support for reform of the laws regarding real or personal property. See Property law - Wikipedia
in scheme: political affiliation
related: progressivism

protestant
in dataset: The CWRC Ontology
type: political affiliation
type: Concept
value: protestantism
comment: The description for this term is indebted to DBpedia.
label: Protestant rule
label: gouvernement protestant @fr
definition: Défenseur du gouvernement protestant au Royaume-Uni. Voir Réforme anglaise — Wikipédia @fr
definition: Support for protestant rule in the United Kingdom. See English Reformation - Wikipedia
in scheme: political affiliation

Protestantism
in dataset: The CWRC Ontology
type: religion
type: Concept
comment: La description de ce terme est basée sur celle de DBPedia. @fr
comment: The description for this term is indebted to the Getty Art & Architecture Thesaurus.
label: hsin chiao @zh-latn
label: protestant @nl
label: protestantisme @fr
label: protestantismo @es
label: xin jiao @zh-latn
label: xīn jiāo @zh-latn
label: 抗羅宗 @zh-hant
label: 新教 @zh-hant
broader transitive: Christianity
definition: "De algemene term voor typen christelijk geloof die zijn ontstaan tijdens de Reformatie. Hoewel de vroegste vormen van protestantisme werden beoefend door de volgelingen van Luther, Calvijn en Zwingli, wordt de term tegenwoordig gebruikt voor de meeste overtuigingen die niet rooms-katholiek of orthodox zijn. Protestanten willen dichter bij de geloofsstijl van de vroege kerk staan, die volgens hen in de katholieke praktijk overschaduwd is geraakt. De term is afkomstig van het woord 'protestari', wat niet alleen 'protesteren' betekent, maar ook 'belijden'. Enkele algemene kenmerken van het protestantisme zijn: rechtvaardiging door het geloof alleen, de berusting van alle gezag bij de Bijbel en de leer dat alle gelovigen zelf hun zonden aan God kunnen belijden, waarbij het aanhoren van de biecht niet alleen aan priesters is voorbehouden." (Getty, 2017) @nl
definition: "El término general para tipos de fe cristiana originadas a partir de la Reforma. Aunque las formas tempranas del protestantismo fueron aquellas que obedecían a Lutero, Calvino y Zwinglio, el término ahora incluye la mayoría de las denominaciones no Romanas o no Ortodoxas. El caracter común de los protestantes incluye la justificación de la fe por la fe, la autoridad de la sagrada escritura y el sacerdocio de todos los fieles, por el que cada creyente puede oir la confesión de los pecados, no siendo exclusivo del clero. protestantes quieren estar cerca al estilo de fe de la primera Iglesia el cual sienten ha sido opacado en las prácticas católicas. El término deriva desde la palabra "protestari" que significa no sólo protestar sino que reconocer o confesar. Característica común." (Getty, 2017) @es
definition: "Le protestantisme est l'une des principales branches du christianisme avec le catholicisme et l'orthodoxie. Entendu largement, le protestantisme est l'ensemble des groupements «issus, directement ou non, de la Réforme et qui rejettent l'autorité du pape». Selon cette perspective, le protestantisme englobe des mouvements variés allant des luthériens passant par les évangéliques, jusqu'aux quakers." (DBpedia, 2017) @fr
definition: "The general term for types of Christian faith originating from the Reformation. Although the early forms of Protestantism were those who followed Luther, Calvin, and Zwingli, the term now includes most non-Roman Catholic or non-Orthodox denominations. Protestants want to be closer to the style of faith of the early Church which they feel has been obscured in Catholic practices. The term derives from the word 'protestari' which means not only to protest but to avow or confess. Common characteristics of Protestantism include the justification by faith alone, the authority of scripture, and the priesthood of all believers, in which not only the clergy are able to hear the confession of sin." (Getty, 2017)
definition: "泛稱源自宗教改革的各式基督信仰。雖然早期的新教形式是指遵循路德(Luther)、喀爾文(Calvin)，以及茨溫利(Zwingli)的派別，但現在新教這個詞彙包含了大部分非羅馬天主教或非正教的派別。新教徒希望能更接近早期教會信仰，認為天主教將之變得晦澀難解。本詞彙衍生自"protestari"，不僅意指抗議，更要坦白或懺悔。新教的常見特色包括因純信而稱義、經典的權威性、信徒皆牧師，所以不是只有牧師才能聽取認罪懺悔。" (Getty, 2017) @zh-hant
in scheme: religion

Quakerism
in dataset: The CWRC Ontology
type: religion
type: Concept
comment: La description de ce terme est basée sur celle de DBPedia. @fr
comment: The description for this term is indebted to DBpedia.
label: quaker @fr
broader transitive: Dissent (Protestant)
definition: "Het Religieus Genootschap der Vrienden, beter bekend als quakers, verouderd Nederlands kwakers, vormt een groep ondogmatische gelovigen, die zijn wortels vindt in de christelijke traditie. Het leven en de overgeleverde uitspraken van Jezus vormen een belangrijke inspiratiebron." (DBpedia, 2017) @nl
definition: "La Société religieuse des Amis est un mouvement religieux fondé en Angleterre au XVIIe siècle par des dissidents de l'Église anglicane. Les membres de ce mouvement sont communément connus sous le nom de quakers () mais ils se nomment entre eux «Amis» et «Amies». Le mouvement est souvent nommé simplement Société des Amis et le surnom de «quaker» apparaît le plus souvent dans la dénomination officielle, sous la forme Société religieuse des Amis (quakers). Les historiens s'accordent à désigner George Fox comme le principal fondateur ou le plus important meneur des débuts du mouvement. Depuis sa création en Angleterre, le mouvement s'est d'abord répandu dans les pays de colonisation anglo-saxonne. Au XXe siècle, des missionnaires quakers ont propagé leur religion en Amérique latine et en Afrique. Aujourd'hui, les quakers déclarent être au nombre d'environ 350 000 dans le monde. La Société des Amis se différencie de la plupart des autres groupes issus du christianisme par l'absence de credo et de toute structure hiérarchique. Pour les quakers, la croyance religieuse appartient à la sphère personnelle et chacun est libre de ses convictions. Le concept de «lumière intérieure» (inner light) est cependant partagé par la plupart d'entre eux, quelle que soit la signification donnée à ces mots. De nombreux quakers reconnaissent le christianisme mais ne ressentent pas leur foi comme entrant dans les catégories chrétiennes traditionnelles. On trouve aujourd'hui dans la Société des Amis des pratiques très diverses, y compris un large courant évangélique." (DBpedia, 2017) @fr
definition: "Quakers (or Friends) are members of a group of religious Christian movements which is known as the Religious Society of Friends in Europe, Australia, New Zealand and parts of North America; and known as the Friends Church in Africa, Asia, South America and parts of the US. The movements were originally, and are still predominantly based on Christianity. Members of the movements profess the priesthood of all believers, a doctrine derived from the First Epistle of Peter. They include those with evangelical, holiness, liberal, and traditional Quaker understandings of Christianity. To differing extents, the different movements that make up the Religious Society of Friends/Friends Church avoid creeds and hierarchical structures. In 2007, there were approximately 359,000 adult Quakers." (DBpedia, 2017)
in scheme: religion

Quaker
is replaced by: Quakerism
in dataset: The CWRC Ontology
type: Concept
comment: Deprecated in favour of instance Quakerism.
comment: Désapprouver en faveur de l'instance quaker. @fr
comment: La description de ce terme est basée sur celle de DBPedia. @fr
label: quaker @fr
deprecated: true
term status: deprecated
broader transitive: Anglicanism
broader transitive: Dissenters
definition: "Het Religieus Genootschap der Vrienden, beter bekend als quakers, verouderd Nederlands kwakers, vormt een groep ondogmatische gelovigen, die zijn wortels vindt in de christelijke traditie. Het leven en de overgeleverde uitspraken van Jezus vormen een belangrijke inspiratiebron." (DBpedia, 2017) @nl
definition: "La Société religieuse des Amis est un mouvement religieux fondé en Angleterre au XVIIe siècle par des dissidents de l'Église anglicane. Les membres de ce mouvement sont communément connus sous le nom de quakers () mais ils se nomment entre eux «Amis» et «Amies». Le mouvement est souvent nommé simplement Société des Amis et le surnom de «quaker» apparaît le plus souvent dans la dénomination officielle, sous la forme Société religieuse des Amis (quakers). Les historiens s'accordent à désigner George Fox comme le principal fondateur ou le plus important meneur des débuts du mouvement. Depuis sa création en Angleterre, le mouvement s'est d'abord répandu dans les pays de colonisation anglo-saxonne. Au XXe siècle, des missionnaires quakers ont propagé leur religion en Amérique latine et en Afrique. Aujourd'hui, les quakers déclarent être au nombre d'environ 350 000 dans le monde. La Société des Amis se différencie de la plupart des autres groupes issus du christianisme par l'absence de credo et de toute structure hiérarchique. Pour les quakers, la croyance religieuse appartient à la sphère personnelle et chacun est libre de ses convictions. Le concept de «lumière intérieure» (inner light) est cependant partagé par la plupart d'entre eux, quelle que soit la signification donnée à ces mots. De nombreux quakers reconnaissent le christianisme mais ne ressentent pas leur foi comme entrant dans les catégories chrétiennes traditionnelles. On trouve aujourd'hui dans la Société des Amis des pratiques très diverses, y compris un large courant évangélique." (DBpedia, 2017) @fr
definition: "Quakers (or Friends) are members of a group of religious Christian movements which is known as the Religious Society of Friends in Europe, Australia, New Zealand and parts of North America; and known as the Friends Church in Africa, Asia, South America and parts of the US. The movements were originally, and are still predominantly based on Christianity. Members of the movements profess the priesthood of all believers, a doctrine derived from the First Epistle of Peter. They include those with evangelical, holiness, liberal, and traditional Quaker understandings of Christianity. To differing extents, the different movements that make up the Religious Society of Friends/Friends Church avoid creeds and hierarchical structures. In 2007, there were approximately 359,000 adult Quakers." (DBpedia, 2017)
in scheme: religion

queer identity
in dataset: The CWRC Ontology
has literal form: queer
type: textual label
type: Concept
one of: genderqueer
definition: A subclass of textual label, this discursive label reflects the ambiguity of queerness associated with different cultural forms. It provides a means of aggregating and searching multiple instances of "Queer" (e.g. genderqueer) cultural identities.
in scheme: textual label
name: queer (Label)

activist for racial equality
in dataset: The CWRC Ontology
contrary to: racist
type: political affiliation
type: Concept
value: race equality
value: racial equality activist
value: racial integration
value: racial integrationist
comment: The description for this term is indebted to DBpedia.
label: racial equality
label: équité raciale @fr
definition: "Racial equality is an equal regard to all races. It can refer to a belief in biological equality of all human races, and it can also refer to social equality for people of different races. Racial equality is a stated goal of most current political movements. The divergence of any particular society from a state of racial equality is often contested by members of that society of different races. In today's society, there is more diversity and more integration among races. However, attaining equality has been difficult for African Americans, Asians, and Latinos, especially in schools." (DBpedia, 2017)
in scheme: political affiliation

racist
in dataset: The CWRC Ontology
contrary to: abolition
contrary to: anti-segregationist
type: political affiliation
type: Concept
comment: La description de ce terme est basée sur celle de DBPedia. @fr
comment: The description for this term is indebted to DBpedia.
label: Racisme @fr
label: racism
definition: "Le racisme est une idéologie qui, partant du postulat de l'existence de races au sein de l'espèce humaine, considère que certaines catégories de personnes sont intrinsèquement supérieures à d'autres. Cette idéologie peut entraîner une attitude d'hostilité ou de sympathie systématique à l'égard d'une catégorie déterminée de personnes. Cette hostilité envers une autre appartenance culturelle et ethnique se traduit par des formes de xénophobie ou d'ethnocentrisme. Certaines formes d'expression du racisme, comme les injures racistes, la diffamation raciale, la discrimination, sont considérées comme des délits dans un certain nombre de pays. Les idéologies racistes ont servi de fondement à des doctrines politiques conduisant à pratiquer des discriminations raciales, des ségrégations ethniques et à commettre des injustices et des violences, allant jusqu'au génocide. Le Petit Larousse définit aussi le racisme comme «une attitude d'hostilité répétée voire systématique à l'égard d'une catégorie déterminée de personnes»." (DBpedia, 2017) @fr
definition: "Racism is a product of the complex interaction in a given society of a race-based worldview with prejudice, stereotyping, and discrimination. Racism can be present in social actions, practices, or political systems (e.g., apartheid) that support the expression of prejudice or aversion in discriminatory practices. The ideology underlying racist practices often includes the idea that humans can be subdivided into distinct groups that are different in their social behavior and innate capacities and that can be ranked as inferior or superior. Racist ideology can become manifest in many aspects of social life. Associated social actions may include xenophobia, otherness, segregation, hierarchical ranking, supremacism, and related social phenomena. While race and ethnicity are considered to be separate in contemporary social science, the two terms have a long history of equivalence in popular usage and older social science literature. "Ethnicity" is often used in a sense close to one traditionally attributed to "race": the division of human groups based on qualities assumed to be essential or innate to the group (e.g. shared ancestry or shared behavior). Racism and racial discrimination are often used to describe discrimination on an ethnic or cultural basis, independent of whether these differences are described as racial. According to a United Nations convention, there is no distinction between the terms "racial" and "ethnic" discrimination. The UN convention further concludes that superiority based on racial differentiation is scientifically false, morally condemnable, socially unjust and dangerous, and there is no justification for racial discrimination, anywhere, in theory or in practice. Today, the use of the term "racism" does not easily fall under a single definition. It is usually found in, but usage is not limited to, law, the social and behavioral sciences, humanities, and popular culture." (DBpedia, 2017)
in scheme: political affiliation

radical
in dataset: The CWRC Ontology
type: political affiliation
type: Concept
comment: The description for this term is indebted to DBpedia.
label: radicalism
label: radicalisme @fr
definition: "The term political radicalism (or simply, in political science, radicalism) denotes political principles focused on altering social structures through revolutionary means and changing value systems in fundamental ways. Derived from the Latin radix (root), the denotation of radical has changed since its eighteenth-century coinage to comprehend the entire political spectrum—yet retains the "change at the root" connotation fundamental to revolutionary societal change. Historically, radicalism has referred exclusively to the radical left (under the single category of far-left politics) and rarely incorporating far-right politics, though these may have revolutionary elements; the prominent exception is in the United States where some consider radicalism to include both political extremes of the radical left and the radical right. In traditional labels of the spectrum of political thought, the opposite of radical on the "right" of the political spectrum is termed reactionary. The nineteenth-century Cyclopaedia of Political Science (1881, 1889) reports that "radicalism is characterized less by its principles than by the manner of their application". Conservatives often used the term radical pejoratively, whereas contemporary left radicals used the term conservative derogatorily; thus contemporary denotations of radical, radicalism, and political radicalism comprehend far left (hard left, radical left), and far right (hard right, radical right). The Encyclopædia Britannica records the first political usage of radical as ascribed to the British Whig Party parliamentarian Charles James Fox, who, in 1797, proposed a "radical reform" of the electoral system, franchise to provide universal manhood suffrage, thereby, idiomatically establishing radical to denote supporters of the reformation of the British Parliament. Throughout the nineteenth century, the term was combined with political notions and doctrines, thus working class radicalism, middle class-, philosophic-, democrati…
in scheme: political affiliation

Rational Dissenter
is replaced by: Dissenting Christianity
in dataset: The CWRC Ontology
type: Concept
comment: Deprecated in favour of instance Dissenting Christianity.
comment: Désapprouver en faveur de l'instance Dissidence anglaise. @fr
deprecated: true
term status: deprecated
broader transitive: Dissenters
definition: "An 18th-century, group much closer to the Anglicanism of their day than other Dissenting sects; however, they believed that state religions impinged on the freedom of conscience. They were fiercely opposed to the hierarchical structure of the Established Church and the financial ties between it and the government."(DBpedia, 2017)
in scheme: religion

rationalist
in dataset: The CWRC Ontology
type: political affiliation
type: Concept
comment: La description de ce terme est basée sur celle de DBPedia. @fr
comment: The description for this term is indebted to DBpedia.
label: Rationalisme @fr
label: rationalism
definition: "In epistemology, rationalism is the view that "regards reason as the chief source and test of knowledge" or "any view appealing to reason as a source of knowledge or justification". More formally, rationalism is defined as a methodology or a theory "in which the criterion of the truth is not sensory but intellectual and deductive". In an old controversy, rationalism was opposed to empiricism, where the rationalists believed that reality has an intrinsically logical structure. Because of this, the rationalists argued that certain truths exist and that the intellect can directly grasp these truths. That is to say, rationalists asserted that certain rational principles exist in logic, mathematics, ethics, and metaphysics that are so fundamentally true that denying them causes one to fall into contradiction. The rationalists had such a high confidence in reason that empirical proof and physical evidence were regarded as unnecessary to ascertain certain truths – in other words, "there are significant ways in which our concepts and knowledge are gained independently of sense experience". Different degrees of emphasis on this method or theory lead to a range of rationalist standpoints, from the moderate position "that reason has precedence over other ways of acquiring knowledge" to the more extreme position that reason is "the unique path to knowledge". Given a pre-modern understanding of reason, rationalism is identical to philosophy, the Socratic life of inquiry, or the zetetic (skeptical) clear interpretation of authority (open to the underlying or essential cause of things as they appear to our sense of certainty). In recent decades, Leo Strauss sought to revive "Classical Political Rationalism" as a discipline that understands the task of reasoning, not as foundational, but as maieutic. In politics, Rationalism, since the Enlightenment, historically emphasised a "politics of reason" centered upon rational choice, utilitarianism, secularism, and irreligion – the latte…
definition: "Le rationalisme est la doctrine qui pose la raison discursive comme seule source possible de toute connaissance réelle. Autrement dit, le réel ne serait connaissable qu'en vertu d'une explication par la raison déterminante, suffisante et nécessaire. Ainsi, le rationalisme s'entend de toute doctrine qui attribue à la seule raison humaine la capacité de connaître et d'établir la vérité. Dans son acception classique, il s'agit de postuler que le raisonnement consiste à déterminer que certains effets résultent de certaines causes, uniquement à partir de principes logiques ; à la manière dont les théorèmes mathématiques résultent des hypothèses admises au départ. De plus, et en particulier, les principes logiques eux-mêmes utilisés dans le raisonnement ont été connus par déduction." (DBpedia, 2017) @fr
in scheme: political affiliation

FAMILY
in dataset: The CWRC Ontology
type: ObjectProperty
label: liens de famille @fr
label: relative of
sub property of: OTHER

republicanism
in dataset: The CWRC Ontology
type: political affiliation
type: Concept
comment: La description de ce terme est basée sur celle de DBPedia. @fr
comment: The description for this term is indebted to DBpedia.
label: Républicanisme @fr
definition: "Le républicanisme est une idéologie politique selon laquelle l'objectif d'un État et le sens de son existence, comme de ses décisions, doivent être le bien commun (en latin, res publica : «la chose publique»). Selon le républicanisme, les détenteurs du pouvoir doivent être nommés par d'autres moyens que l'hérédité, c'est-à-dire être élus par le peuple ou par une partie de celui-ci. La notion de souveraineté populaire découle donc en partie de cette idéologie, mais elle ne lui est pas nécessairement attachée. La notion de «république» remonte à l'Antiquité grecque et romaine, et l'idéologie républicaine moderne a pris des formes légèrement différentes selon qu'elle a été développée aux États-Unis, en France ou en Irlande. À l'époque moderne, le républicanisme s'oppose à d'autres idéologies politiques telles que le monarchisme, l'autoritarisme ou le despotisme. Dans les débats contemporains, c'est principalement au libéralisme politique qu'il s'oppose." (DBpedia, 2017) @fr
definition: "Republicanism is an ideology of being a citizen in a state as a republic under which the people hold popular sovereignty. Many countries are "republics" in the sense that they are not monarchies. However, this article covers only the ideology of republicanism. The word, "republic", derives from the Latin, res publica, which referred to the system of government that emerged in the 6th century BCE following the expulsion of the kings from Rome by Lucius Junius Brutus and Collatinus. This form of government collapsed in the latter part of the 1st century BCE, giving way to what was a monarchy in form, if not in name. Republics revived subsequently, with, for example, Renaissance Florence or early modern Britain. The concept of a republic became a powerful force in Britain's North American colonies where it led to the American Revolution. In Europe it gained enormous influence through the French Revolution." (DBpedia, 2017)
in scheme: political affiliation

pro-revolutionary
in dataset: The CWRC Ontology
type: political affiliation
type: Concept
comment: The description for this term is indebted to DBpedia.
label: revolutionary
label: révolutionnaire @fr
definition: "A revolutionary is a person who either actively participates in, or advocates revolution. Also, when used as an adjective, the term revolutionary refers to something that has a major, sudden impact on society or on some aspect of human endeavor." (DBpedia, 2017)
in scheme: political affiliation

Roma
in dataset: The CWRC Ontology
type: ethnicity
type: Concept
value: gipsy
value: gypsies
value: gypsy
label: Romani
label: rom @fr
definition: "The Romani (also spelled Romany; /ˈroʊməni/, /ˈrɒ-/), or Roma, are a traditionally nomadic ethnic group, living mostly in Europe and the Americas and originating from the northern regions of the Indian subcontinent, presumably from where the states Rajasthan, Haryana, and Punjab exist today. The Romani are widely known among English-speaking people by the exonym "Gypsies" (or "Gipsies"), which some people consider pejorative due to its connotations of illegality and irregularity."(DBpedia, 2017)
definition: «Les Roms (parfois écrit Rroms, également désignés en français sous les noms de Tziganes, Gitans, Bohémiens, Manouches ou Romanichels selon les pays d'où ils sont supposés venir notamment, par les appellations d'origine scientifique Kalés ou Sintis, ou encore gens du voyage par confusion ou vision fantasmée, l'immense majorité étant sédentaire) forment un ensemble de populations établies dans divers pays du monde et se considérant comme formant un seul peuple, en raison de leur origine et de leur culture communes. Originaires de la péninsule indienne, avec des langues initiales qu'on croit originaires du nord-ouest du sous-continent indien, ce peuple, constitué de minorités vivant entre l'Inde et l'Atlantique, puis sur le continent américain, est connu par diverses dénominations exonymes locales. Rom se propose comme une appellation endonyme unique, signifiant «homme accompli et marié au sein de la communauté» en langue romani. Présentes en Europe dès le xie siècle, les populations roms de tous les pays formeraient ensemble, au xxie siècle, selon une étude faite en 1994 pour le conseil de l'Europe, la minorité 'la plus importante en termes numériques.» (DBpedia, 2017) @fr
in scheme: ethnicity

rural unskilled
in dataset: The CWRC Ontology
type: social class
type: Concept
label: ouvrière agricole @fr
definition: Cette classe renvoie aux travailleurs/euses agricoles, généralement des hommes, et concerne des périodes historiques plus reculées. Elle inclut aussi les fermiers/ères migrants/es. @fr
definition: This class generally indicates farm laborers, mostly male and in earlier periods, and includes migrant farm workers. (brown_orlando, 2006)
in scheme: social class

Sabbatarianism
in dataset: The CWRC Ontology
type: political affiliation
type: Concept
comment: The description for this term is indebted to DBpedia.
label: Sabbatarianisme @fr
definition: "Sabbatarianism is a movement within Protestantism whose proponents advocate that certain observances, specifically enumerated in a code of behavior or law, are required for Christians to properly observe the Sabbath or Sabbath principles. Its historical origins lie in Puritan Sabbatarianism, which delineated precepts for keeping Sunday holy in observance of Sabbath commandment principles. This observance of Sunday is the purest form of first-day Sabbatarianism, a movement which diminished and largely disappeared in the 18th century, though traces and influences remain today. Today, seventh-day Sabbatarianism is the most prominent type, a movement that generally embraces a literal reading of the Sabbath commandment that provides for both worship and rest on the seventh day of the week. Seventh-day Baptists leave most other Sabbath considerations of observance to individual conscience. The Seventh-day Adventist Church and Church of God (Seventh Day) have similar views, but maintain the original, scriptural duration as Friday sunset through Saturday sunset. Non-Sabbatarianism is the view opposing all Sabbatarianism, declaring Christians to be free of mandates to follow such specific observances. It upholds the principle in Christian church doctrine that the church is not bound by such law or code, but is free to set in place and time such observances as uphold Sabbath principles according to its doctrine: to establish a day of rest, or not, and to establish a day of worship, or not, whether on Saturday or on Sunday or on some other day. It includes all Catholics and Orthodox, and most Protestant denominations." (DBpedia, 2017)
in scheme: political affiliation
related: Roman Catholicism

sanitary movement
in dataset: The CWRC Ontology
type: political affiliation
type: Concept
comment: The description for this term is indebted to DBpedia.
label: mouvement pour l'assainissement @fr
definition: Promotion of sanitary practices and conditions, often directed at the poor or the reform of urban sanitation, through charitable or political activities. See Sanitation - Wikipedia
definition: Sensibilisation sur les conditions et pratiques sanitaires, généralement pour les plus pauvres, ou réforme de l'hygiène publiques à travers à travers des oeuvres de charité ou d'action politique. Voir Assainissement — Wikipédia. @fr
in scheme: political affiliation
related: urban reformer

scots nationalist
in dataset: The CWRC Ontology
type: political affiliation
type: Concept
value: scottish nationalist
comment: La description de ce terme est basée sur celle de DBPedia. @fr
comment: The description for this term is indebted to DBpedia.
label: Nationalisme écossais @fr
label: Scottish nationalism
broader transitive: nationalism
definition: "Le nationalisme écossais moderne naît dans l'entre-deux-guerres, même si des éléments nationalistes sont depuis plusieurs siècles au cœur de l'identité écossaise. L'article examine le contexte historique et politique qui a vu l'éclosion d'un nationalisme politique en Écosse, depuis la création du SNP (Scottish National Party) en 1934 jusqu'à la mise en place d'un régime de dévolution à l'Écosse à partir de 1999." (DBpedia, 2017) @fr
definition: "Scottish nationalism promotes the idea that the Scottish people form a cohesive nation and national identity and is closely linked to the cause of Scottish home rule and Scottish independence: the ideology of the Scottish National Party (the party forming the Scottish Government). It is often described as a form of civic nationalism rather than ethnic nationalism. The Acts of Union merged the independent kingdoms of Scotland and England into Great Britain in 1707, but a separate legal system and distinct Scottish institutions continued to exist. Linguistic independence was an important part of the twentieth century Scottish Renaissance, associated with the nationalist impetus provided by Hugh MacDiarmid." (DBpedia, 2017)
in scheme: political affiliation

secularist
in dataset: The CWRC Ontology
type: political affiliation
type: Concept
comment: La description de ce terme est basée sur celle de DBPedia. @fr
comment: The description for this term is indebted to DBpedia.
label: Laïcité @fr
label: secularism
definition: "La laïcité ou le sécularisme est le «principe de séparation dans l'État de la société civile et de la société religieuse» et «d'impartialité ou de neutralité de l'État à l'égard des confessions religieuses». Le mot désigne par extension le caractère des «institutions, publiques ou privées, qui sont indépendantes du clergé et des églises». La laïcité s'oppose à la reconnaissance d'une religion d'État. Toutefois, le principe de séparation entre l'État et les religions peut trouver des applications différentes selon les pays." (DBpedia, 2017) @fr
definition: "Secularism is the principle of the separation of government institutions and persons mandated to represent the state from religious institutions and religious dignitaries. One manifestation of secularism is asserting the right to be free from religious rule and teachings, or, in a state declared to be neutral on matters of belief, from the imposition by government of religion or religious practices upon its people. Another manifestation of secularism is the view that public activities and decisions, especially political ones, should be uninfluenced by religious beliefs and/or practices. Secularism draws its intellectual roots from Greek and Roman philosophers such as Epicurus and Marcus Aurelius; from Enlightenment thinkers such as John Locke, Denis Diderot, Voltaire, Baruch Spinoza, James Madison, Thomas Jefferson, and Thomas Paine; and from more recent freethinkers and atheists such as Robert Ingersoll and Bertrand Russell. The purposes and arguments in support of secularism vary widely. In European laicism, it has been argued that secularism is a movement towards modernization, and away from traditional religious values (also known as secularization). This type of secularism, on a social or philosophical level, has often occurred while maintaining an official state church or other state support of religion. In the United States, some argue that has served to a greater extent to protect religion and the religious from governmental interference, while secularism on a social level is less prevalent. Within countries as well, differing political movements support secularism for varying reasons." (DBpedia, 2017)
in scheme: political affiliation

Sephardic Jewish
in dataset: The CWRC Ontology
type: ethnicity
type: Concept
label: Juif séfarade @fr
definition: "Sephardi Jews, also known as Sephardic Jews or simply Sephardim (Hebrew: סְפָרַדִּים, Modern Hebrew: Sfaraddim, Tiberian: Səp̄āraddîm; also יְהוּדֵי סְפָרַד Y'hudey Spharad, lit. "The Jews of Spain"), are a Jewish ethnic division whose ethnogenesis and emergence as a distinct community of Jews coalesced in the Iberian Peninsula around the start of the 2nd millennium (i.e., about the year 1000). They established communities throughout Spain and Portugal, where they traditionally resided, evolving what would become their distinctive characteristics and diasporic identity." (DBpedia, 2017)
definition: «Les Séfarades (parfois orthographié Sépharades) constituent une branche du judaïsme qui suit le judaïsme liturgique espagnol et portugais (en particulier dans la prononciation des mots des prières). Certains ont contribué aux sciences et techniques en al-Andalus comme Maïmonide, Abraham ibn Ezra, Juda Halevi, Nahmanide, Salomon ibn Gabirol et Moïse de Léon. Par extension, le terme «Séfarade» désigne aussi souvent les Juifs non ashkénazes qui ont souvent adopté le rite séfarade au contact des Juifs issus de l'émigration consécutive à l'expulsion des Juifs d'Espagne.» (DBpedia, 2017) @fr
in scheme: ethnicity

servant
in dataset: The CWRC Ontology
type: social class
type: Concept
label: domestique @fr
definition: Domestic servants typically live in the home with the family or institution that employs them, although the lowest class of servants might work only casually and hence not receive room and board. This type of labour, very common before the twentieth century, is distinct from that of service positions such as shop assistants, flight attendants, and restaurant workers. (brown_orlando, 2006)
definition: Les domestiques vivent normalement au sein du foyer de la famille ou de l’institution qui les emploie, même si ceux des classes les plus inférieures n’y travaillent que ponctuellement et ne reçoivent donc ni toit ni pension. Ce type d’emploi, très répandu avant le 20ème siècle, est différent des postes rattachés au tertiaire tels que vendeur/se, personnel de cabine ou serveur/se. @fr
in scheme: social class

sex-trade activist
in dataset: The CWRC Ontology
type: political affiliation
type: Concept
value: sex-trade reformer
value: sexual liberationist
value: sexual libertarian
value: sexual reformer
comment: The description for this term is indebted to DBpedia.
label: révolution sexuelle @fr
label: sexual reform
definition: Advocacy or activism related to the reform of attitudes, practices, and laws related to sex, including autonomy, age of consent, trafficking, and sex work.
definition: Militantisme ou lutte pour le changement des attitutdes, des praitques et des lois liées à l'activité sexuelle, incluant l'autonomie, la maturité sexuelle, les trafics et les travailleurs du sexe. @fr
in scheme: political affiliation
related: activist for women and children
related: pro-choice
related: purity movement

BISEXUAL
in dataset: The CWRC Ontology
type: sexuality
type: Concept
value: BISEXUALITY
label: bisexuality
label: bisexualité @fr
definition: Bisexuality indicates sexual attraction to both genders. In terms of binary understandings of sex or gender, bisexuality is often defined as being sexually attracted to "both sexes".
definition: La bisexualité réfère à l’attraction sexuelle pour les deux genres. En terme d’acceptation binaire du sexe ou du genre, la bisexualité est souvent définie comme attraction sexuelle pour les «deux sexes». @fr
in scheme: sexuality
name: bisexual (sexual identity)

CELIBATE
in dataset: The CWRC Ontology
type: sexuality
type: Concept
label: celibacy
label: célibat @fr
definition: Celibacy indicates abstention from sex, and can stem from personal choice, religious prescriptions, or with religious occupations such as being a nun or priest. Celibacy is not the be confused with asexuality, which describes a lack of interest in sex or sexual attraction to other subjects.
definition: Le célibat indique l’abstinence sexuelle, et peut être dû à un choix personnel, à des impératifs religieux ou des professions cléricales comme religieuse ou prêtre. Le célibat ne doit pas être confondu avec l’asexualité, qui décrit une absence d’intérêt pour les pratiques sexuelles ou d’attirance sexuelle pour d’autres personnes. @fr
in scheme: sexuality

FRIGID
in dataset: The CWRC Ontology
type: sexuality
type: Concept
label: frigidity
label: frigidité @fr
definition: Frigidity labels a female subject as sexually withdrawn or unenthusiastic (read: non-consenting) in relation to the sexual advance, usually of men within a heterosexual framework, and suggests a lack of pleasure from sexual activities. Unlike asexual and celibate, this term is often ascribed to women, as opposed to self-referential. The term "frigid" was coined in the 1920s by sexologists (Sex and Society, Vol. 1, 285). Its use in discourse surrounding female sexuality is waning.
definition: La frigidité est attribuée aux femmes qui se montrent distantes ou peu enthousiastes (comprendre non consentantes) face aux avances sexuelles, le plus souvent de la part d’hommes dans un cadre hétéronormé, et suggère un manque de plaisir associé aux pratiques sexuelles. Contrairement à l’asexualité et au célibat, ce terme est souvent assigné à des femmes, et n'est donc pas autoréférentiel. Le terme «frigide» a été formulé dans les années 20 par des sexologues (Sex and Society, Vol. 1, 285). Son usage est en déclin dans les discours à propos de la sexualité féminine. @fr
in scheme: sexuality

LIBERTINISM
in dataset: The CWRC Ontology
type: sexuality
type: Concept
label: libertinage @fr
label: libertinism
definition: Le libertinage réfère à un type d’identité sexuelle (souvent pour des hommes) utilisé pour décrire un sujet adhérant aux idées et pratiques hédonistes. @fr
definition: Libertinism refers to a type of sexual identity (often tied to men) used to describe a subject who subscribes to hedonistic sexual politics.
in scheme: sexuality

PROMISCUOUS
in dataset: The CWRC Ontology
type: sexuality
type: Concept
label: promiscuity
label: promiscuité @fr
definition: La promiscuité indique l’activité sexuelle avec des partenaires multiples de façon décomplexée et indifférenciée, en opposition aux pratiques sexuelles socialement acceptées. La promiscuité est différemment interprétée pour les femmes et les hommes dans la plupart des contextes historiques et culturelles, étant étroitement liée au contrôle de la sexualité féminine et de la reproduction. Elle inclut le libertinage, une forme de sexualité hédoniste fréquemment attribuée à ou adoptée par des hommes. @fr
definition: Promiscuity indicates sex with multiple partners in a casual or indiscriminate fashion and in opposition to socially sanctioned sexual behaviour. Promiscuity is differently constructed for women and men in most historical and cultural contexts, being closely connected to the control of female sexuality and reproduction. It includes libertinism, a form of hedonistic sexual politics frequently ascribed to or adopted by men.
in scheme: sexuality

shopkeepers
in dataset: The CWRC Ontology
type: social class
type: Concept
label: commerçants @fr
definition: Habituellement attribué à quelqu’un qui «possède et tient un bar ou une boutique», mais dont l’activité est plus réduite que celle d’un entrepreneur ou d’un industriel. @fr
definition: Typically applied to someone who "owns and runs a pub or shop," but not on the scale of an entrepreneur or industrialist. (brown_orlando, 2006)
in scheme: social class

SIBLING
in dataset: The CWRC Ontology
type: ObjectProperty
label: frères et soeurs de @fr
label: sibling of
sub property of: FAMILY

SISTER
in dataset: The CWRC Ontology
type: ObjectProperty
label: sister of
label: soeur de @fr
sub property of: SIBLING

artisan
in dataset: The CWRC Ontology
type: social class
type: Concept
label: artisane qualifiée @fr
definition: Celle classe inclut des métiers tels que tailleur/euse, orfèvre, cordonnier/ère, chapelier/ère et couturier/ère. @fr
definition: This class includes such trades as "goldsmith, tailor, shoemaker, milliner, and dressmaker." (brown_orlando, 2006)
in scheme: social class

purity movement
in dataset: The CWRC Ontology
type: political affiliation
type: Concept
comment: The description for this term is indebted to DBpedia.
label: abolition de la prostitution (Royaume-Uni) @fr
label: social purity
definition: "The social purity movement was a late 19th-century social movement that sought to abolish prostitution and other sexual activities that were considered immoral according to Christian morality. Composed primarily of women, the movement was active in English-speaking nations from the late 1860s to about 1910, exerting an important influence on the contemporaneous feminist, eugenics, and birth control movements. The movement helped to shape feminist views on prostitution. The roots of the social purity movement lay in early 19th-century moral reform movements, such as radical utopianism, abolitionism, and the temperance movement. In the late 19th century, "social" was a euphemism for "sexual"; the movement first formed in opposition to the legalization and regulation of prostitution, and quickly spread to other sex-related issues such as raising the age of consent, sexually segregating prisons, eliminating abortion, opposing contraception, and censoring pornography." (DBpedia, 2017)
in scheme: political affiliation
related: activist for women and children

progressivism
in dataset: The CWRC Ontology
type: political affiliation
type: Concept
value: reform
value: reformer
value: reformers
value: reformist
value: social reformer
value: social welfare
comment: The description for this term is indebted to DBpedia.
label: réforme sociale @fr
label: social reform
definition: "A reform movement is the kind of social movement that aims to make gradual change, or change in certain aspects of society, rather than rapid or fundamental changes. A reform movement is distinguished from more radical social movements such as revolutionary movements. Reformists' ideas are often grounded in liberalism, although they may be rooted in socialist (specifically, social democratic) or religious concepts. Some rely on personal transformation; others rely on small collectives, such as Mahatma Gandhi's spinning wheel and the self-sustaining village economy, as a mode of social change. Reactionary movements, which can arise against any of these, attempt to put things back the way they were before any successes the new reform movement(s) enjoyed, or to prevent any such successes." (DBpedia, 2017)
in scheme: political affiliation

militant socialist
in dataset: The CWRC Ontology
type: political affiliation
type: Concept
value: owenite socialism
value: socialist
value: socialist and feminist
value: socialist feminist
comment: La description de ce terme est basée sur celle de DBPedia. @fr
comment: The description for this term is indebted to DBpedia.
label: socialism
label: socialisme @fr
definition: "Le mot socialisme recouvre un ensemble très divers de courants de pensée et de mouvements politiques, dont le point commun est de rechercher une organisation sociale et économique plus juste. Le but originel du socialisme est d'obtenir l'égalité sociale, ou du moins une réduction des inégalités, et notamment pour les courants d'inspiration marxiste, d'établir une société sans classes sociales. Plus largement, le socialisme peut être défini comme une tendance politique, historiquement marquée à gauche, dont le principe de base est l'aspiration à un monde meilleur, fondé sur une organisation sociale harmonieuse et sur la lutte contre les injustices. Selon les contextes, le mot socialisme ou l'adjectif socialiste peuvent qualifier une idéologie, un parti politique, un régime politique ou une organisation sociale. Le mot socialisme lui-même entre dans le langage courant à partir des années 1820, dans le contexte de la révolution industrielle et de l'urbanisation qui l'accompagne : il désigne alors un ensemble de revendications et d'idées visant à améliorer le sort des ouvriers, et plus largement de la population, via le remplacement du capitalisme par une société supposée plus juste. L'idée socialiste, sous de multiples formes, se développe au long du XIXe siècle et donne naissance dans le monde entier à des partis politiques s'en réclamant sous diverses dénominations (socialiste, mais également social-démocrate, travailliste, etc.). Dans la seconde moitié du XIXe siècle, le marxisme supplante l'approche dite du «socialisme utopique», ainsi que le «socialisme libertaire» des anarchistes : le courant de pensée marxiste se veut porteur d'une forme «scientifique» de socialisme, fondé sur une analyse du capitalisme, du dépassement de celui-ci par le biais de la lutte des classes et du passage à la propriété sociale des moyens de production. Dans les dernières années du siècle, une partie du socialisme européen s'oriente cependant dans les faits vers le réformisme. À la fin… @fr
definition: "Socialism is a range of economic and social systems characterised by social ownership and democratic control of the means of production; as well as the political ideologies, theories, and movements that aim at their establishment. Social ownership may refer to forms of public, collective, or cooperative ownership; to citizen ownership of equity; or to any combination of these. Although there are many varieties of socialism and there is no single definition encapsulating all of them, social ownership is the common element shared by its various forms. Socialist economic systems can be divided into both non-market and market forms. Non-market socialism involves the substitution of factor markets and money with engineering and technical criteria based on calculation performed in-kind, thereby producing an economic mechanism that functions according to different economic laws from those of capitalism. Non-market socialism aims to circumvent the inefficiencies and crises traditionally associated with capital accumulation and the profit system. By contrast, market socialism retains the use of monetary prices, factor markets, and, in some cases, the profit motive with respect to the operation of socially owned enterprises and the allocation of capital goods between them. Profits generated by these firms would be controlled directly by the workforce of each firm or accrue to society at large in the form of a social dividend. The feasibility and exact methods of resource allocation and calculation for a socialist system are the subjects of the socialist calculation debate. The socialist political movement includes a diverse array of political philosophies that originated amid the revolutionary movements of the mid-to-late 1700s and of a general concern for the social problems that were associated with capitalism. In addition to the debate over markets and planning, the varieties of socialism differ in their form of social ownership, how management is to be organized within p…
in scheme: political affiliation
related: christian communist
related: progressivism

pro-toleration
in dataset: The CWRC Ontology
type: political affiliation
type: Concept
comment: La description de ce terme est basée sur celle de DBPedia. @fr
comment: The description for this term is indebted to DBpedia.
label: Society of Friends
label: Société religieuse des Amis @fr
broader transitive: human rights activist
definition: "La Société religieuse des Amis est un mouvement religieux fondé en Angleterre au XVIIe siècle par des dissidents de l'Église anglicane. Les membres de ce mouvement sont communément connus sous le nom de quakers () mais ils se nomment entre eux «Amis» et «Amies». Le mouvement est souvent nommé simplement Société des Amis et le surnom de «quaker» apparaît le plus souvent dans la dénomination officielle, sous la forme Société religieuse des Amis (quakers). Les historiens s'accordent à désigner George Fox comme le principal fondateur ou le plus important meneur des débuts du mouvement. Depuis sa création en Angleterre, le mouvement s'est d'abord répandu dans les pays de colonisation anglo-saxonne. Au XXe siècle, des missionnaires quakers ont propagé leur religion en Amérique latine et en Afrique. Aujourd'hui, les quakers déclarent être au nombre d'environ 350 000 dans le monde. La Société des Amis se différencie de la plupart des autres groupes issus du christianisme par l'absence de credo et de toute structure hiérarchique. Pour les quakers, la croyance religieuse appartient à la sphère personnelle et chacun est libre de ses convictions. Le concept de «lumière intérieure» (inner light) est cependant partagé par la plupart d'entre eux, quelle que soit la signification donnée à ces mots. De nombreux quakers reconnaissent le christianisme mais ne ressentent pas leur foi comme entrant dans les catégories chrétiennes traditionnelles. On trouve aujourd'hui dans la Société des Amis des pratiques très diverses, y compris un large courant évangélique." (DBpedia, 2017) @fr
definition: "Quakers (or Friends) are members of a historically Christian group of religious movements generally known as the Religious Society of Friends. Members of the various Quaker movements are all generally united in a belief in the ability of each human being to experientially access "that of God in every person," and therefore they profess the priesthood of all believers, a doctrine derived from the First Epistle of Peter. They include those with evangelical, holiness, liberal, and traditional Quaker understandings of Christianity. To differing extents, the different movements that make up the Religious Society of Friends/Friends Church avoid creeds and hierarchical structures. In 2007, there were approximately 359,000 adult Quakers. In 2012, there were 377,055 adult Quakers. Around 79% of Quakers worldwide belong to the "evangelical" and "programmed" branches of Quakerism—these Quakers worship in services with singing and a prepared message from the Bible, coordinated by a pastor. Around 11% of Friends practice waiting worship, or unprogrammed worship (more commonly known today as Meeting for Worship), where the order of service is not planned in advance, is predominantly silent, and may include unprepared vocal ministry from those present. Some meetings of both types have Recorded Ministers in their meetings—Friends recognised for their gift of vocal ministry. The first Quakers lived in mid-17th century England. The movement arose from the Legatine-Arians and other dissenting Protestant groups, breaking away from the established Church of England. The Quakers, especially the ones known as the Valiant Sixty, attempted to convert others to their understanding of Christianity, travelling both throughout Great Britain and overseas, preaching the gospel of Jesus Christ. Some of these early Quaker ministers were women. They based their message on the religious belief that "Christ has come to teach his people himself", stressing the importance of a direct relationship with …
in scheme: political affiliation
related: abolition
related: activist for women and children

SON
in dataset: The CWRC Ontology
type: ObjectProperty
label: fil de @fr
label: son of
sub property of: CHILD

spanish republican
in dataset: The CWRC Ontology
type: political affiliation
type: Concept
value: spanish republican supporter
comment: The description for this term is indebted to DBpedia.
label: Spanish republicanism
label: républicanisme Espagnol @fr
broader transitive: republicanism
definition: "There has existed in the Kingdom of Spain a persistent trend of republican thought, especially throughout the 19th, 20th, and 21st centuries, that has manifested itself in diverse political parties and movements over the entire course of the history of Spain. While these movements have shared the objective of establishing a republic in Spain, during these three centuries there have surged distinct schools of thought on the form republicans would want to give to the Spanish State: unitary (centralized) or federal. Despite the country's long-lasting schools of republican movements, the government of Spain has been organized as a republic during only two very short periods in its history, which totaled less than 10 years of republican government in the entirety of Spanish history. The First Spanish Republic lasted from February 1873 to December 1874, and the Second Spanish Republic lasted from April 1931 to April 1939. Currently there are movements and political parties throughout the entire political spectrum that advocate for a Third Spanish Republic, including almost all of the Spanish left, as well as liberal, right-winged, and nationalist parties." (DBpedia, 2017)
in scheme: political affiliation

Spiritualism
in dataset: The CWRC Ontology
type: religion
type: Concept
label: Spritisme @fr
subclass of: Spiritualism
definition: "Le spiritisme est considéré, selon les sources, comme une superstition, comme une science occulte ou comme une doctrine. Il est fondé sur la croyance que certains phénomènes paranormaux sont le moyen pour des entités de l'au-delà appelées «esprits», le plus souvent des personnes décédées, de communiquer avec les vivants. Ce mot s'applique ainsi, de manière large, à un courant disparate où les pratiquants, appelés «spirites», communiquent avec ces «esprits» par divers moyens, comme des sujets en état de transe (médiums) ou des supports inanimés (tables tournantes...)".(DBpedia, 2017) @fr
definition: "Spiritualism is the belief that the spirits of the dead have both the ability and the inclination to communicate with the living. The afterlife, or the "spirit world", is seen by spiritualists not as a static place, but as one in which spirits continue to evolve. These two beliefs: that contact with spirits is possible, and that spirits are more advanced than humans, lead spiritualists to a third belief, that spirits are capable of providing useful knowledge about moral and ethical issues, as well as about the nature of God. Some spiritualists will speak of a concept which they refer to as "spirit guides"—specific spirits, often contacted, who are relied upon for spiritual guidance. Spiritism, a branch of spiritualism developed by Allan Kardec and today practiced mostly in Continental Europe and Latin America, especially in Brazil, emphasises reincarnation." (DBpedia, 2017)
in scheme: religion

Social Sciences and Humanities Research Council
type: Organization
name: Conseil de recherches en sciences humaines @fr
nick: SSHRC

stalinist
in dataset: The CWRC Ontology
type: political affiliation
type: Concept
value: totalitarian
comment: La description de ce terme est basée sur celle de DBPedia. @fr
comment: The description for this term is indebted to DBpedia.
label: Stalinism
label: Stalinisme @fr
broader transitive: christian communist
definition: "Le mot stalinisme désigne l’idéologie et la pratique politique des partis communistes ayant adopté la ligne politique définie par les partisans de Joseph Staline, secrétaire général du Parti communiste de l'Union soviétique. Par extension, ces partis et leurs membres ont été qualifiés de staliniens. Le stalinisme est caractérisé par le centralisme et l'emploi de la force et de la terreur comme mode de gouvernement, accompagnés d'un culte de la personnalité organisé autour du principal dirigeant de chaque Parti communiste. Les régimes staliniens se caractérisent par une économie planifiée par l'état. Par extension, le terme de stalinisme et les adjectifs stalinien ou, plus rarement, staliniste sont parfois utilisés pour qualifier l'ensemble des régimes basés sur le modèle soviétique, ainsi que les partis politiques les soutenant. Après la déstalinisation (1956), l'Union soviétique cesse de se réclamer de Staline, mais le terme stalinisme et l'adjectif stalinien continuent d'être utilisés, dans le cadre de discours critiques ou polémiques, pour qualifier l'URSS, l'ensemble des pays du bloc de l'Est et plus largement l'ensemble des régimes dictatoriaux communistes. En Europe après la déstalinisation, seule la République populaire socialiste d'Albanie s'est réclamée de la continuité stalinienne. En Asie en revanche, ce fut encore, durant des décennies, le cas des régimes communistes chinois, vietnamien, laotien, cambodgien et surtout coréen qui, au XXIe siècle, est parfois qualifiée de «dernier régime stalinien»." (DBpedia, 2017) @fr
definition: "Stalinism is the means of governing and related policies implemented by Joseph Stalin. Stalinist policies in the Soviet Union included state terror, rapid industrialization, the theory of socialism in one country, a centralized state, collectivization of agriculture, cult of personality in leadership, and subordination of interests of foreign communist parties to those of the Communist Party of the Soviet Union—deemed by Stalinism to be the most forefront vanguard party of communist revolution at the time. Stalinism promoted the escalation of class conflict, utilizing state violence to forcibly purge society of claimed supporters of the bourgeoisie, regarding them as threats to the pursuit of the communist revolution that resulted in substantial political violence and persecution of such people. These included not only bourgeois people but also working-class people accused of counter-revolutionary sympathies. Stalinist industrialization was officially designed to accelerate the development towards communism, stressing that such rapid industrialization was needed because the country was previously economically backward in comparison with other countries; and that it was needed in order to face the challenges posed by internal and external enemies of communism. Rapid industrialization was accompanied with mass collectivization of agriculture and rapid urbanization. Rapid urbanization converted many small villages into industrial cities. To accelerate the development of industrialization, Stalin pragmatically created joint venture contracts with major American private enterprises, such as Ford Motor Company, that under state supervision assisted in developing the basis of industry of the Soviet economy from the late 1920s to 1930s. After the American private enterprises completed their tasks, Soviet state enterprises took over." (DBpedia, 2017)
in scheme: political affiliation
related: Bolshevist
related: christian communist
related: marxist

STEPBROTHER
in dataset: The CWRC Ontology
type: ObjectProperty
label: brother of
label: frère de @fr
sub property of: BROTHER

STEPCHILD
in dataset: The CWRC Ontology
type: ObjectProperty
label: enfant d'un autre mariage @fr
label: step-child of
sub property of: FAMILY

STEPDAUGHTER
in dataset: The CWRC Ontology
type: ObjectProperty
label: belle-fille de @fr
label: step-daughter of
sub property of: STEPCHILD

STEPFATHER
in dataset: The CWRC Ontology
type: ObjectProperty
label: beau-père de @fr
label: father of
sub property of: step parent of
definition: Please be aware of the ambiguous nature of the french label for this term, which means here a person taking on the role of father to a child while not being the child's biological father.
definition: Une personne qui prend le rôle d'un père pour un enfant sans être son père biologique. Notez-bien l’ambiguïté avec le text français pour le rôle du mari d'une soeur or d'un frère. @fr

STEPMOTHER
in dataset: The CWRC Ontology
type: ObjectProperty
label: belle-mère de @fr
label: step mother of
sub property of: step parent of
definition: Please be aware of the ambiguous nature of the french label for this term, which means here a person taking on the role of mother to a child while not being the child's birth mother.
definition: Une personne qui prend le rôle d'une mère pour un enfant sans être sa mère biologique. Notez-bien l’ambiguïté avec le text français pour le rôle de la femme d'une soeur or d'un frère. @fr

step parent of
in dataset: The CWRC Ontology
type: ObjectProperty
label: step parent de @fr
sub property of: FAMILY

STEPSISTER
in dataset: The CWRC Ontology
type: ObjectProperty
label: sister of
label: soeur de @fr
sub property of: SISTER

STEPSON
in dataset: The CWRC Ontology
type: ObjectProperty
label: beau-fils de @fr
label: step-son of
sub property of: STEPCHILD

christian suffragist
in dataset: The CWRC Ontology
contrary to: anti-feminist
type: political affiliation
type: Concept
value: female suffrage
value: moderate suffragist
value: non-militant suffragist
value: suffrage
value: suffragism
value: suffragist
value: women's suffrage
comment: La description de ce terme est basée sur celle de DBPedia. @fr
comment: The description for this term is indebted to DBpedia.
label: Droit de vote @fr
label: suffrage movement
broader transitive: activist for women and children
broader transitive: progressivism
definition: "Le droit de vote permet aux citoyens d'un État de voter pour exprimer leur volonté, à l'occasion d'un scrutin. Dans son application contemporaine, il pose un choix et permet, soit d'élire des gouvernants à but représentatif, soit de répondre à une question posée par la gouvernance, sous forme de plébiscite ou de référendum. Les démocraties modernes présentent le droit de vote comme un droit civique fondamental. À partir du XIXe siècle, le vote devient un synonyme de démocratie, alors qu'auparavant il désignait un régime aristocratique ou oligarchique." (DBpedia, 2017) @fr
definition: "Suffrage, political franchise, or simply franchise is the right to vote in public, political elections (although the term is sometimes used for any right to vote). The right to run for office is sometimes called candidate eligibility, and the combination of both rights is sometimes called full suffrage. In many languages, the right to vote is called the active right to vote and the right to run for office is called the passive right to vote. In English, these are sometimes called active suffrage and passive suffrage. Suffrage is often conceived in terms of elections for representatives. However, suffrage applies equally to referenda and initiatives. Suffrage describes not only the legal right to vote, but also the practical question of whether a question will be put to a vote. The utility of suffrage is reduced when important questions are decided unilaterally by elected or non-elected representatives. In most democracies, eligible voters can vote in elections of representatives. Voting on issues by referendum may also be available. For example, in Switzerland this is permitted at all levels of government. In the United States, some states such as California and Washington have exercised their shared sovereignty to offer citizens the opportunity to write, propose, and vote on referendums and initiatives; other states have not. The United States federal government does not offer any initiatives at all. Suffrage is granted to qualifying citizens once they have reached the voting age. What constitutes a qualifying citizen depends on the government's decision, but most democracies no longer extend differing rights to vote on the basis of sex or race. Resident non-citizens can vote in some countries, which may be restricted to citizens of closely linked countries (e.g., Commonwealth citizens and European Union citizens)." (DBpedia, 2017)
in scheme: political affiliation

tax resister
in dataset: The CWRC Ontology
type: political affiliation
type: Concept
value: tax withholder
comment: La description de ce terme est basée sur celle de DBPedia. @fr
comment: The description for this term is indebted to DBpedia.
label: Résistance fiscale @fr
label: tax resistance
definition: "La résistance fiscale (ou résistance à l'imposition ou désobéissance fiscale) est un acte politique consistant à refuser de participer à la fiscalité de son pays au nom de valeurs morales. C'est une forme de résistance non-violente." (DBpedia, 2017) @fr
definition: "Tax resistance is the refusal to pay tax because of opposition to the government that is imposing the tax or to government policy or as opposition to the concept of taxation in itself. Tax resistance is a form of direct action and if in violation of the tax regulations, a form of civil disobedience. Examples of tax resistance campaigns include those advocating home rule, such as the Salt March led by Mahatma Gandhi, and those promoting women's suffrage, such as the Women's Tax Resistance League. War tax resistance is the refusal to pay some or all taxes that pay for war and a form of nonviolent resistance. War tax resistance may be practiced by conscientious objectors, pacifists, or those protesting against a particular war. As a percentage of income tax funds military expenditure, war tax resisters may avoid or refuse to pay some or all income tax. For example, war resisters may choose to avoid taxes by living simply below the income tax threshold. Tax resisters are distinct from tax protesters who deny that the legal obligation to pay taxes exists or applies. Tax resisters may accept that some law commands them to pay taxes but they still choose to resist taxation." (DBpedia, 2017)
in scheme: political affiliation
related: anti-monarchist

temperance
in dataset: The CWRC Ontology
type: political affiliation
type: Concept
value: temperance activist
value: temperance supporter
comment: La description de ce terme est basée sur celle de DBPedia. @fr
comment: The description for this term is indebted to DBpedia.
label: Ligue de tempérance @fr
label: temperance movement
definition: "The temperance movement is a social movement against the consumption of alcoholic beverages. Temperance movements typically criticize excessive alcohol consumption, promote complete abstinence (teetotalism), or use its political influence to press the government to enact alcohol laws to regulate the availability of alcohol or even its complete prohibition." (DBpedia, 2017)
definition: "Une Ligue de tempérance est une association formée pour s'opposer à la consommation d'alcools. Son fondement est souvent d'ordre religieux ou moral : la plupart des mouvements du XXe siècle en Occident sont également associés au mouvement féministe, l'alcool étant souvent la cause de violences conjugales et absorbant une part substantielle des revenus des familles à bas revenus." (DBpedia, 2017) @fr
in scheme: political affiliation
related: conservative
related: activist for women and children

Thracians
in dataset: The CWRC Ontology
type: ethnicity
type: Concept
label: Thracian
label: thrace @fr
definition: "The Thracians (/ˈθreɪʃənz/; Ancient Greek: Θρᾷκες Thrāikes, Latin: Thraci) were a group of Indo-European tribes inhabiting a large area in southeastern Europe. They spoke the Thracian language – a scarcely attested branch of the Indo-European language family. The study of Thracians and Thracian culture is known as Thracology." (DBpedia, 2017)
definition: «Les Thraces constituaient un peuple de langue paléo-balkanique (donc indo-européenne) dont les tribus, signalées dans les Balkans en même temps que les Achéens, les Éoliens et les Ioniens, partageaient un ensemble de croyances, un mode de vie et une même langue avec des variantes et dialectes. Leur civilisation, encore mal connue, s'est épanouie du IIe millénaire av. J.‑C. au iiie siècle av. J.-C., sur un substrat anté-indo-européen dit «pélasge» développé dès le Ve millénaire av. J.‑C. comme civilisation agricole et pourvue de nécropoles richement dotées en or. L'étymologie de ce nom reste incertaine. Orale, la culture des Thraces était faite de légendes et de mythes incluant la croyance en l'immortalité sous la forme de l'«orphisme», décrit par Hérodote. Les connaissances que nous avons de ce peuple viennent des auteurs grecs anciens et de découvertes archéologiques récentes.» (DBpedia, 2017) @fr
in scheme: ethnicity

tory
in dataset: The CWRC Ontology
contrary to: dissident whig
type: political affiliation
type: Concept
comment: The description for this term is indebted to DBpedia.
label: Parti Tory (Royaume-Uni) @fr
label: Tory Party (Britain)
broader transitive: conservative
definition: "The Tories were members of two political parties which existed, sequentially, in the Kingdom of England, the Kingdom of Great Britain and later the United Kingdom of Great Britain and Ireland from the 17th to the early 19th centuries. The first Tories emerged in 1678 in England, when they opposed the Whig-supported Exclusion Bill which set out to disinherit the heir presumptive James, Duke of York (who eventually became James II of England and VII of Scotland). This party ceased to exist as an organised political entity in the early 1760s, although it was used as a term of self-description by some political writers. A few decades later, a new Tory party would rise to establish a hold on government between 1783 and 1830, with William Pitt the Younger followed by Robert Jenkinson, 2nd Earl of Liverpool. The Earl of Liverpool was succeeded by fellow Tory Arthur Wellesley, 1st Duke of Wellington, whose term included the Catholic Emancipation, which occurred mostly due to the election of Daniel O'Connell as a Catholic MP from Ireland. When the Whigs subsequently regained control, the Representation of the People Act 1832 removed the rotten boroughs, many of which were controlled by Tories. In the following general election, the Tory ranks were reduced to 180 MPs. Under the leadership of Robert Peel, the Tamworth Manifesto was issued, which began to transform the Tories into the Conservative Party. However, Peel lost many of his supporters by repealing the Corn Laws, causing the party to break apart. One faction, led by the Earl of Derby and Benjamin Disraeli, survived to become the modern Conservative Party, whose members are commonly still referred to as Tories." (DBpedia, 2017)
in scheme: political affiliation

Tractarian Movement
in dataset: The CWRC Ontology
type: religion
type: Concept
comment: The description for this term is indebted to DBpedia.
label: tractarianisme @fr
subclass of: Oxford Movement
broader transitive: Anglicanism
definition: "Le Mouvement d’Oxford (Oxford Movement) est un courant théologique anglais du XIXe siècle, situé dans la lignée des théories défendues par la Haute Église (High Church) anglicane".(DBpedia, 2017) @fr
definition: "The Oxford Movement was a movement of High Church members of the Church of England which eventually developed into Anglo-Catholicism. The movement, whose original devotees were mostly associated with the University of Oxford, argued for the reinstatement of some older Christian traditions of faith and their inclusion into Anglican liturgy and theology. They thought of Anglicanism as one of three branches of the One, Holy, Catholic, and Apostolic Church. The movement's philosophy was known as Tractarianism after its series of publications, the Tracts for the Times, published from 1833 to 1841. Tractarians were also disparagingly referred to as "Newmanites" (before 1845) and "Puseyites" (after 1845) after two prominent Tractarians, John Henry Newman and Edward Bouverie Pusey. Other well-known Tractarians included John Keble, Charles Marriott, Richard Froude, Robert Wilberforce, Isaac Williams, and William Palmer".(DBpedia, 2017)
in scheme: religion

trade unionist
in dataset: The CWRC Ontology
type: political affiliation
type: Concept
value: union movement
value: unionism
comment: The description for this term is indebted to DBpedia.
label: syndicalisme @fr
label: trade unionism
broader transitive: progressivism
definition: In support of the formation of a trade union. See Trade union - Wikipedia
definition: Lutte pour la consitution de syndicats professionnels. Voir Syndicat professionnel — Wikipédia et Syndicalisme — Wikipédia @fr
in scheme: political affiliation

transgender
in dataset: The CWRC Ontology
type: gender
type: Concept
label: transgenre @fr
definition: Indicates divergence of a person's gender identity from their sex as understood or assigned at birth. Unlike transwoman or transman, "the term transgender is not indicative of gender expression," nor is it indicative of "sexual orientation, hormonal makeup, physical anatomy, or how one is perceived in daily life."(TSER, 2017)
definition: Indique la discordance entre le genre et le sexe d’une personne, tel que celui-ci a été compris ou assigné à sa naissance. Contrairement à femme trans ou homme trans, «le terme n’est pas révélateur de l’expression du genre, de l’orientation sexuelle, de la constitution hormonale, de l’anatomie, ou de la façon dont une personne est perçue au quotidien» (TSER, 2017). @fr
in scheme: gender

transman/transmale
in dataset: The CWRC Ontology
type: gender
type: Thing
type: Concept
label: homme trans @fr
broader: manlabel
definition: Indique habituellement l’identification en tant qu’homme alors que le sexe «féminin» a été assigné à la naissance. Certains hommes trans renoncent à la mention «trans» et préfèrent utiliser le terme «homme» seul. (TSER, 2017). Cette définition inclut également les garçons trans. @fr
definition: Typically indicates identification as a man while having been assigned the sex "female" at birth. Some trans men prefer to drop the prefix "trans" and keep the label "man" (TSER, 2017). This definition includes trans boys too.
in scheme: gender
name: transman/transmale (gender)

transwoman/transfemale
in dataset: The CWRC Ontology
type: gender
type: Thing
type: Concept
label: femme trans @fr
broader: womanlabel
definition: Indique habituellement l’identification en tant que femme alors que le sexe «masculin» a été assigné à la naissance. Certaines femmes trans renoncent à la mention «trans» et préfèrent utiliser le terme «femme» seul. (TSER, 2017). Cette définition inclut également les filles trans. @fr
definition: Typically indicates identification as a woman while having been assigned the sex "male" at birth. Some trans women prefer to drop the prefix "trans" and keep the label "woman" (TSER, 2017). This definition includes trans girls too.
in scheme: gender
name: transwoman/transfemale (gender)

UNCLE
in dataset: The CWRC Ontology
type: ObjectProperty
label: oncle de @fr
label: uncle of
sub property of: FAMILY

unitarianChurch
is replaced by: unitarianMovement
in dataset: The CWRC Ontology
type: Concept
comment: Deprecated in favour of instance Unitarianism.
comment: Désapprouver en faveur de l'instance unitarisme. @fr
comment: La description de ce terme est basée sur celle de DBPedia. @fr
label: Unitarian Church
label: Église unitarienne @fr
deprecated: true
term status: deprecated
broader transitive: Christianity
definition: "Unitarian church usually refers to a church (either a single church or a group of churches and/or its followers) which follows Unitarianism, a Christian theology. It can also more broadly refer to a church which is a member of an umbrella group with "Unitarian" in its title, such as the Unitarian Universalist Association in the U.S., the Canadian Unitarian Council, and similar bodies." (DBpedia, 2017)

unitarianMovement
in dataset: The CWRC Ontology
type: religion
type: Concept
comment: La description de ce terme est basée sur celle de DBPedia. @fr
comment: The description for this term is indebted to the Getty Art & Architecture Thesaurus.
label: Unitarianism
label: unitarios @es
label: unitarisme @fr
label: unitarismo @es
subclass of: Unitarianism
alternative label: Unitarian
alternative label: Unitarian Church
alternative label: Unitarian Movement
broader transitive: Dissent (Protestant)
definition: "In het bijzonder te gebruiken voor de vrijzinnig protestantse beweging die in Europa opkwam tijdens de Reformatie in de 16de eeuw, werd belichaamd door een kerk in Transsylvanië en een confessionele status verkreeg in Groot-Brittannië, de Verenigde Staten en Canada tijdens de 19de eeuw. De beweging wordt gekenmerkt door de afwijzing van de orthodox christelijke leer van de Drie-eenheid en de goddelijke Christus, het vrije gebruik van de rede in religieuze zaken en het geloof dat God bestaat in één persoon. In 1961 fuseerde deze beweging in de Verenigde Staten en Canada met de universalistische beweging, waardoor het ‘unitaristisch universalisme’ ontstond. Ook in het algemeen te gebruiken voor de theologische leer van de eenheid van God en het mens-zijn van Jezus, zoals voor het eerst verwoord in het monarchisme van de 2de en 3de eeuw en in de leer van Arius in de 3de en 4de eeuw, en later in de leer van de radicale neoplatonisten uit de Reformatie zoals Michael Servetus, Faustus Socinus en Ferenc David." (Getty, 2017) @nl
definition: "L’unitarisme est une doctrine qui affirme que le Dieu du christianisme est une seule personne, et non pas une seule nature ou «ousie» en trois hypostases comme l'affirme le dogme de la Trinité : Père, Fils et Esprit. Selon le dogme de la Trinité, ces trois personnes divines participent d'une seule nature divine unique . Le «trinitarisme» est la doctrine officielle du christianisme depuis le premier concile de Nicée (325) et le concile de Chalcédoine (451)." (DBpedia, 2017) @fr
definition: "The liberal Protestant movement that arose in Europe during the 16th century Reformation, was embodied in a church in Transylvania, and achieved denominational status in the 19th century in the United Kingdom, the United States, and Canada. It is characterized by a denial of the orthodox Christian doctrines of the Trinity and the divinity of Jesus, the free use of reason in religion, and the belief that God exists in one person. In 1961, in the United States and Canada, it merged with the Universalist denomination to form "Unitarian Universalism." Use also generally for the theological doctrines of the unified nature of God and the humanity of Jesus, first expressed in second- and third-century monarchism and in the teachings of Arius in the third and fourth centuries, and later in the radical Neoplatonist thinkers of the Reformation such as Michael Servetus, Faustus Socinus, and Ferenc David." (Getty, 2017)
definition: "Úsese específicamente para el movimiento protestante liberal que surgió en Europa durante la Reforma del siglo XVI, que tuvo su manifestación en una iglesia en Transilvania, y que logró un estatus confesional en el siglo XIX en el Reino Unido, los Estados Unidos y Canadá. Es caracterizado por una desaprobación de las doctrinas cristianas ortodoxas de la Trinidad y la divinidad de Jesús, el libre uso de la razón en la religión y la creencia que Dios existe en una persona. En 1961, en los Estados Unidos y Canadá s" (Getty, 2017) @es
in scheme: religion

Unknown
in dataset: The CWRC Ontology
type: Concept
comment: Deprecated with no current equivalence.
label: Inconnue @fr
deprecated: true
term status: deprecated
name: Unknown (Sex)

upper-middle class
in dataset: The CWRC Ontology
type: social class
type: Concept
comment: This term is a CWRC specific addition not in the original Orlando tag set.
label: classe moyenne supérieure @fr
definition: 45xCe modèle est-il pertinent ? Cliquez pour en voir d'autres.Cet article ne respecte pas la neutralité de point de vue (indiquez la date de pose grâce au paramètre date). Considérez son contenu avec précaution et/ou discutez-en. Il est possible de préciser les sections non neutres en utilisant {{section non neutre}} et de souligner les passages problématiques avec {{passage non neutre}}. 45xCe modèle est-il pertinent ? Cliquez pour en voir d'autres.Cet article ne cite pas suffisamment ses sources (indiquez la date de pose grâce au paramètre date). @fr
definition: The upper middle class is a sociological concept referring to the social group constituted by higher status members of the middle class. This is in contrast to the term "lower middle class", which is used for the group at the opposite end of the middle class stratum, and to the broader term "middle class". There is considerable debate as to how the upper middle class might be defined. According to sociologist Max Weber the upper middle class consists of well-educated professionals with graduate degrees and comfortable incomes.
in scheme: social class
note: Overlaps with the class.

urban unskilled
in dataset: The CWRC Ontology
type: social class
type: Concept
label: ouvrier non qualifié @fr
definition: Cette classe inclut les ouvriers/ères d’usine et les travailleurs/euses des grandes industries ou des industries urbaines, qui ne possèdent ni profession ni qualification définie. Elle renvoie également aux emplois du secteur des services avec des salaires et des statuts faibles, comme la restauration ou l'industrie du fast-food dans les sociétés industrielles et postindustrielles. @fr
definition: This class includes factory workers and workers in urban or large-scale industries without defined trades or professional qualifications, and those in low-wage and low-status service sector jobs, such as the restaurant or fast-food industry, in industrial or post-industrial societies. (brown_orlando, 2006)
in scheme: social class

urban reformer
in dataset: The CWRC Ontology
type: political affiliation
type: Concept
comment: The description for this term is indebted to DBpedia.
label: renouvellement urbain @fr
label: urban reform
broader transitive: progressivism
definition: Advocacy or activism in support of reforming the urban environment, often in support of alleviating poverty. See Urban renewal - Wikipedia
definition: Militantisme ou lutte en faveur de la réforme de l'environnement urbain, souvent pour réduire les problèmes de pauvreté. Voir Renouvellement urbain — Wikipédia @fr
in scheme: political affiliation

vegetarian
in dataset: The CWRC Ontology
type: political affiliation
type: Concept
comment: La description de ce terme est basée sur celle de DBPedia. @fr
comment: The description for this term is indebted to DBpedia.
label: Végétarisme @fr
label: vegetarianism
definition: "Le végétarisme est une pratique alimentaire qui exclut la consommation de chair animale. Sa définition la plus large correspond à l'ovo-lacto-végétarisme, qui consiste à consommer des végétaux, des champignons et des aliments d'origine animale (comme le miel, les œufs, le lait ainsi que leurs produits dérivés). Il s'agit du végétarisme occidental classique dont les pratiquants étaient appelés «pythagoréens / pythagoriciens» jusqu'en 1847. Le végétarisme indien (hindou et sikh), basé sur l'ahimsâ, autorise la consommation de produits laitiers mais exclut les œufs (les Lois de Manu excluent aussi la consommation des champignons). Le végétarisme est adopté pour des motivations diverses. Certains deviennent végétariens pour des raisons éthiques, religieuses, culturelles ou liées à la santé. D'autres facteurs peuvent motiver l'adoption d'un régime végétarien : la critique des méthodes de traçabilité, d'élevage et d'abattage, l'accès aux denrées alimentaires, l'impact environnemental des modes de production et de prélèvement de ces dernières (les économies d'énergies et d'eau) ou encore le refus par principe de l'exploitation animale. Plusieurs études tendent à montrer qu'une alimentation végétarienne aurait un effet bénéfique sur la santé — diminution des risques de maladies cardiovasculaires et de diabète notamment — et sur l'espérance de vie. Pour autant, cet avantage des régimes sans viande est moins important lorsqu'on les compare avec des régimes omnivores sains. Dans le langage courant, toutes les pratiques alimentaires excluant la chair animale mais incluant la consommation d'autres produits d'origine animale sont appelées «végétarisme» et leurs pratiquants «végétariens». D'autres pratiques alimentaires influencées par le végétarisme existent, comme le pesco-végétarisme (ou «pescétarisme») qui inclut la consommation de poisson, de mollusques et de crustacés aquatiques, ou le flexitarisme, souvent qualifié de «semi-végétarisme», qui inclut une consommation de vian… @fr
definition: "Vegetarianism /vɛdʒɪˈtɛəriənɪzəm/ is the practice of abstaining from the consumption of meat (red meat, poultry, seafood, and the flesh of any other animal), and may also include abstention from by-products of animal slaughter. Vegetarianism can be adopted for different reasons. Many object to eating meat out of respect for sentient life. Such ethical motivations have been codified under various religious beliefs, along with animal rights. Other motivations for vegetarianism are health-related, political, environmental, cultural, aesthetic, economic, or personal preference. There are varieties of the diet as well: an ovo-vegetarian diet includes eggs but not dairy products, a lacto-vegetarian diet includes dairy products but not eggs, and an ovo-lacto vegetarian diet includes both eggs and dairy products. A vegan diet excludes all animal products, including eggs, dairy, and honey. Some vegans also avoid other animal products such as beeswax, leather or silk clothing, and goose-fat shoe polish. Various packaged or processed foods, including cake, cookies, candies, chocolate, yogurt and marshmallows, often contain unfamiliar animal ingredients, and may be a special concern for vegetarians due to the likelihood of such additions. Often, products are reviewed by vegetarians for animal-derived ingredients prior to purchase or consumption. Vegetarians vary in their feelings regarding these ingredients, however. For example, while some vegetarians may be unaware of animal-derived rennet's role in the usual production of cheese and may therefore unknowingly consume the product, other vegetarians may not take issue with its consumption. Semi-vegetarian diets consist largely of vegetarian foods, but may include fish or poultry, or sometimes other meats, on an infrequent basis. Those with diets containing fish or poultry may define meat only as mammalian flesh and may identify with vegetarianism. This is because earlier dictionaries included fish as part of the definition whe…
in scheme: political affiliation
related: animal activist

Welsh
in dataset: The CWRC Ontology
type: national heritage
type: Concept
label: Gallois @fr
broader: welshLabel
definition: Indicates a subject's identification with or labelling as Welsh as an inherited national identity.

welsh nationalist
in dataset: The CWRC Ontology
type: political affiliation
type: Concept
comment: La description de ce terme est basée sur celle de DBPedia. @fr
comment: The description for this term is indebted to DBpedia.
label: Nationalisme gallois @fr
label: Welsh nationalism
broader transitive: nationalism
definition: "Welsh nationalism (Welsh: Cenedlaetholdeb Cymreig) emphasises the distinctiveness of Welsh language, culture, and history, and calls for more self-determination for Wales, which might include more devolved powers for the Welsh Assembly or full independence from the United Kingdom." (DBpedia, 2017)
definition: Le nationalisme gallois consiste dans le projet de défense de l'identité du Pays de Galles, de la culture et de la langue galloise. Ses revendications vont de l'autonomisme, visant à obtenir des pouvoirs accrus pour l'Assemblée nationale du Pays de Galles et le gouvernement gallois, à l'indépendantisme, défendu notamment par le parti Plaid Cymru. * Portail de la politique britannique Portail de la politique britannique * Portail du pays de Galles" Portail du pays de Galles" (DBpedia, 2017) @fr
in scheme: political affiliation

Wends or Sorbs
in dataset: The CWRC Ontology
type: ethnicity
type: Concept
label: Wende @fr
label: Wendish
definition: "Wends (Old English: Winedas, Old Norse: Vindr, German: Wenden, Winden, Danish: vendere, Swedish: vender, Polish: Wendowie) is a historical name for the West Slavs living near Germanic settlement areas. It does not refer to a homogeneous people, but to various peoples, tribes or groups depending on where and when it is used." (DBpedia, 2017)
definition: «Le nom de Wendes, transcription germanique du latin Venedi, peut avoir plusieurs sens : Les Wendes (Venedi) en l'an 125, dans la perspective historique. Le mot désigne l'ensemble des Slaves. dans une perspective historique, communément admise par les milieux universitaires, l'ethnonyme Wenden désigne toutes les tribus slaves en allemand : c'est le nom donné au Moyen ge par les Allemands à tous les peuples slaves établis sur le territoire délimité par l'Oder, la Spree, la Saale et les monts Métallifères. Les Wendes de la basse Elbe et de la côte Baltique étaient des Polabes et des Obodrites, ceux du sud-est des Slovinces et ceux de l'Elbe supérieure des Sorabes.»(DBpedia, 2017) @fr
in scheme: ethnicity

dissident whig
in dataset: The CWRC Ontology
type: political affiliation
type: Concept
value: foxite whig
value: opposition whig
value: pittite whig
value: whig
value: whigs
value: williamite
comment: The description for this term is indebted to DBpedia.
label: whiggism
label: whiggisme @fr
definition: "Whiggism, sometimes spelled Whigism, is a historical political philosophy that grew out of the Parliamentarian faction in the Wars of the Three Kingdoms (1639–1651). The whigs' key policy positions were the supremacy of Parliament (as opposed to that of the king), tolerance of Protestant dissenters, and opposition to a Catholic (especially a Stuart) on the throne. After the huge success of the Glorious Revolution of 1688–1689, Whiggism dominated English and British politics until about 1760, although in practice it splintered into different factions. After 1760 the Whigs lost power, apart from sharing it in a few short-lived coalitions, but Whiggism fashioned itself into a generalized belief system that emphasised innovation and liberty and was strongly held by about half of the leading families in England and Scotland, as well as most merchants, Dissenters and professionals. The opposing Tory position was held by the other great families, the Church of England, and most of the landed gentry and officers of the army and the navy. Whigs who opposed Robert Walpole often called themselves "Old Whigs" and comprised part of the Country Party. Whiggism referred originally to the Whigs of the British Isles, but in its "Old Whig" form was largely adopted by the American Patriots in the Thirteen Colonies. American Whiggism was known as republicanism. One meaning of 'whiggism' given by the Oxford English Dictionary is "moderate or antiquated Liberalism"." (DBpedia, 2017)
in scheme: political affiliation
related: anti-conservative
related: liberal

white
in dataset: The CWRC Ontology
type: ethnicity
type: Thing
type: Concept
label: blanc @fr
broader: white identity
definition: "White people is a racial classification specifier, used for people of Europid ancestry, with the exact implications dependent on context. The contemporary usage of 'white people' or a 'white race; as a large group of (mainly European) populations contrasting with 'black', American Indian, 'colored' or non-white originates in the 17th century. It is today particularly used as a racial classifier in multiracial societies, such as the United States (White American), the United Kingdom (White British), Brazil (White Brazilian), and South Africa (White South African). Various social constructions of whiteness have been significant to national identity, public policy, religion, population statistics, racial segregation, affirmative action, white privilege, eugenics, racial marginalization and racial quotas. The term 'white race' or 'white people' entered the major European languages in the later 17th century, in the context of racialized slavery and unequal status in European colonies. Description of populations as 'white' in reference to their skin color predates this notion and is found in Greco-Roman ethnography and other ancient sources. Scholarship on race generally distinguishes the modern concept from pre-modern descriptions of collective difference." (DBpedia, 2017)
definition: «Le terme Blanc est employé, dans le langage courant, pour désigner des êtres humains caractérisés notamment par une couleur de peau claire. Le terme est généralement employé pour désigner les individus présentant des caractéristiques physiques qui sont historiquement associées aux populations européennes. La définition d'un 'individu blanc' diffère sensiblement d'après les contextes historiques, légaux, culturels, et géographiques. Dans certains contextes, en particulier aux États-Unis, le terme 'caucasien' est utilisé comme synonyme. D'un point de vue biologique, la peau blanche est une adaptation génétique issue de la sélection naturelle favorisant la synthèse de la vitamine D en milieu faiblement ensoleillé en permettant une pénétration plus profonde des rayons de soleil dans l'épiderme du fait d'un taux de mélanine plus bas2,3. Les latitudes tempérées sont moins soumises aux risques liés au rayonnement ultraviolet, à l'inverse des milieux fortement ensoleillés dans lesquels les individus ont la peau plus foncée.» (DBpedia, 2017) @fr
in scheme: ethnicity
name: white (ethnicity)

white identity
in dataset: The CWRC Ontology
has literal form: blanc @fr
has literal form: white
type: textual label
type: Concept
label: identité blanche @fr
one of: white
one of: creole (typically caucasian (european settler descendants)
definition: A subclass of textual label, this discursive label reflects the ambiguity of whiteness associated with different cultural forms. It provides a means of aggregating and searching multiple instances of "White" (e.g. whiteNationality, whiteRace) cultural identities.
in scheme: textual label
name: white

white
is replaced by: creole (typically caucasian (european settler descendants)
in dataset: The CWRC Ontology
type: Concept
comment: Deprecated in favour of instance white.
comment: Désapprouver en faveur de l'instance blanc. @fr
label: blanc @fr
subclass of: white identity
deprecated: true
term status: deprecated
name: White (Race Colour)

creole (typically caucasian (european settler descendants)
in dataset: The CWRC Ontology
type: race or colour
type: Thing
type: Concept
label: blanc @fr
label: white
broader: SkinColorSimpleWhite
broader: white identity
definition: "White people is a racial classification specifier, used for people of Europid ancestry, with the exact implications dependent on context. The contemporary usage of 'white people' or a 'white race' as a large group of (mainly European) populations contrasting with 'black', American Indian, colored' or non-white originates in the 17th century. It is today particularly used as a racial classifier in multiracial societies, such as the United States (White American), the United Kingdom (White British), Brazil (White Brazilian), and South Africa (White South African). Various social constructions of whiteness have been significant to national identity, public policy, religion, population statistics, racial segregation, affirmative action, white privilege, eugenics, racial marginalization and racial quotas. The term 'white race' or 'white people' entered the major European languages in the later 17th century, in the context of racialized slavery and unequal status in European colonies. Description of populations as 'white' in reference to their skin color predates this notion and is found in Greco-Roman ethnography and other ancient sources. Scholarship on race generally distinguishes the modern concept from pre-modern descriptions of collective difference." (DBpedia, 2017)
definition: «Le terme Blanc est employé, dans le langage courant, pour désigner des êtres humains caractérisés notamment par une couleur de peau claire. Le terme est généralement employé pour désigner les individus présentant des caractéristiques physiques qui sont historiquement associées aux populations européennes. La définition d'un «individu blanc» diffère sensiblement d'après les contextes historiques, légaux, culturels, et géographiques. Dans certains contextes, en particulier aux États-Unis, le terme «caucasien» est utilisé comme synonyme. D'un point de vue biologique, la peau blanche est une adaptation génétique issue de la sélection naturelle favorisant la synthèse de la vitamine D en milieu faiblement ensoleillé en permettant une pénétration plus profonde des rayons de soleil dans l'épiderme du fait d'un taux de mélanine plus bas. Les latitudes tempérées sont moins soumises aux risques liés au rayonnement ultraviolet, à l'inverse des milieux fortement ensoleillés dans lesquels les individus ont la peau plus foncée.» (DBpedia, 2017) @fr
in scheme: race or colour
name: white (race colour)

WIFE
in dataset: The CWRC Ontology
type: ObjectProperty
label: femme de @fr
label: wife of
sub property of: PARTNER
different from: Partnership

Wilkite
in dataset: The CWRC Ontology
type: political affiliation
type: Concept
comment: The description for this term is indebted to DBpedia.
broader transitive: progressivism
definition: A view of the law, in support of John Wilkes. Focused on government accountability and right to trial by jury. See: John Wilkes - Wikipedia
definition: Conception de la loi en accord avec John Wilkes. Comprend surtout la responsabilité gouvernementale et le droit au procès devant jury. Voir John Wilkes — Wikipédia @fr
in scheme: political affiliation

woman
in dataset: The CWRC Ontology
type: gender
type: Thing
type: Concept
label: femme @fr
broader: womanlabel
definition: Indicates a subject identification with or labelling as the gender woman, and who is often but not necessarily understood to be sexed female. "One is not born, but rather becomes, woman" (Simone de Beauvoir, 1973)
definition: Indique l’identification ou l’assignation au genre féminin, et qui est souvent mais non nécessairement de sexe féminin. «On ne naît pas femme, on le devient»: Simone de Beauvoir, Le deuxième sexe (1973) @fr
in scheme: gender
name: woman (gender)

woman
in dataset: The CWRC Ontology
has literal form: femme @fr
has literal form: woman
type: textual label
type: Concept
label: femme @fr
one of: woman
one of: ciswoman
one of: transwoman/transfemale
one of: LESBIAN
definition: A subclass of textual label, this discursive label reflects the ambiguity of womanhood, femininity, or femaleness associated with different cultural forms. It provides a means of aggregating and searching multiple instances of "woman" (e.g. woman, transwoman/transfemale) cultural identities.
in scheme: textual label
name: Woman (Label)

womanist
in dataset: The CWRC Ontology
contrary to: anti-feminism
type: political affiliation
type: Concept
comment: The description for this term is indebted to DBpedia.
label: féminisme africain @fr
label: womanism
broader transitive: activist for women and children
definition: "Womanism is a social theory deeply rooted in the racial and gender-based oppression of black women. There are varying interpretations on what the term "womanist" means, and efforts to provide a concise and all encompassing definition have only been marginally successful. The ambiguity within the theory allows for its continuous expansion of its basic tenets, though this ambiguity is also widely considered its greatest weakness. At its core, womanism is a social change perspective based upon the everyday problems and experiences of black women and other women of minority demographics, but more broadly seeks methods to eradicate inequalities not just for black women, but for all people." (DBpedia, 2017)
in scheme: political affiliation
related: anti-racism

activist for women's education
in dataset: The CWRC Ontology
contrary to: anti-feminism
type: political affiliation
type: Concept
value: campaigner for women's education
value: female education
value: female education advocate
value: women's education reformer
value: women's higher education
value: women's medical education
comment: The description for this term is indebted to DBpedia.
label: réforme de l'éducation des filles @fr
label: women's education reform
broader transitive: education reformer
broader transitive: activist for women and children
definition: Reform of education for women. See Female education - Wikipedia; Category:Women and education - Wikipedia
definition: Réforme de l'éducation des femmes. Voir Histoire des femmes dans l'enseignement public français — Wikipédia et Histoire de l'éducation des filles en France — Wikipédia @fr
in scheme: political affiliation

employment activist
in dataset: The CWRC Ontology
contrary to: anti-feminism
type: political affiliation
type: Concept
value: equal rights in the work place
value: female employment
value: women's employment reformer
comment: The description for this term is indebted to DBpedia.
label: réforme du travail des femmes @fr
label: women's employment reform
broader transitive: activist for women and children
broader transitive: progressivism
definition: Advocacy or activism related to women's employment including training, opportunities, wages, and working conditions. See Women in the workforce - Wikipedia
definition: Militantisme et lutte liés à l'emploi des femmes, incluant le droits à la formation, aux opportunités, aux salaires et aux conditions de travail décentes. Voir Inégalités de revenu — Wikipédia @fr
in scheme: political affiliation

yeoman farmer
in dataset: The CWRC Ontology
type: social class
type: Concept
label: paysanne yeoman @fr
definition: Les membres de cette classe historique «posséd[aient] juste assez de terre pour subvenir à leurs besoins, à condition qu’ils fassent eux-mêmes la plus grande partie du travail». Elizabeth Ham et Mary Webb en sont des exemples. @fr
definition: Members of this historic class "own[ed] just enough land to support themselves if they did most of the work themselves." Examples include Elizabeth Ham and Mary Webb. (brown_orlando, 2006)
in scheme: social class

zionist
in dataset: The CWRC Ontology
type: political affiliation
type: Concept
comment: La description de ce terme est basée sur celle de DBPedia. @fr
comment: The description for this term is indebted to DBpedia.
label: Sionisme @fr
label: Zionism
broader transitive: nationalism
definition: "Le sionisme est une idéologie politique fondée sur un sentiment national juif, décrite comme nationaliste par les uns et comme émancipatrice par les autres, prônant l'existence d'un centre territorial ou étatique peuplé par les Juifs en Terre d'Israël (Eretz Israël). À la naissance du mouvement, à la fin du XIXe siècle, ce territoire correspondait à la Palestine ottomane, puis après la Première Guerre mondiale à la partie occidentale de la Palestine mandataire. Sur un plan idéologique et institutionnel, le sionisme entend œuvrer à donner ou redonner aux Juifs un statut perdu depuis l'annexion du Royaume d'Israël par l'Empire assyrien en -720, à savoir celui d'un peuple disposant d'un territoire. Il faut le différencier du post-sionisme, qui veut donner une orientation laïque à l'État d'Israël, normaliser les relations avec les Palestiniens, et du néo-sionisme, qui milite pour la migration des Palestiniens et des Arabes israéliens vers les autres pays arabes. Le mouvement sioniste est né parmi les communautés ashkénazes d'Europe centrale et orientale sous la pression des pogroms, mais aussi en Europe occidentale, à la suite du choc causé par l'affaire Dreyfus – qui compte parmi les motifs du lancement du Congrès sioniste par Theodor Herzl. Bien qu'ayant des caractères spécifiques du fait de la dispersion des Juifs, cette idéologie est contemporaine de l'affirmation d'autres nationalismes en Europe." (DBpedia, 2017) @fr
definition: "Zionism is a nationalist political movement of Jews and Jewish culture that supports the re-establishment of a Jewish homeland in the territory defined as the historic Land of Israel (roughly corresponding to Palestine, Canaan or the Holy Land). Zionism emerged in the late 19th century in central and eastern Europe as a national revival movement, in reaction to anti-Semitic and exclusionary nationalist movements in Europe. Soon after this, most leaders of the movement associated the main goal with creating the desired state in Palestine, then an area controlled by the Ottoman Empire. Until 1948, the primary goals of Zionism were the re-establishment of Jewish sovereignty in the Land of Israel, ingathering of the exiles, and liberation of Jews from the antisemitic discrimination and persecution that they experienced during their diaspora. Since the establishment of the State of Israel in 1948, Zionism continues primarily to advocate on behalf of Israel and address threats to its continued existence and security. A religious variety of Zionism supports Jews upholding their Jewish identity defined as adherence to religious Judaism, opposes the assimilation of Jews into other societies, and has advocated the return of Jews to Israel as a means for Jews to be a majority nation in their own state. A variety of Zionism, called cultural Zionism, founded and represented most prominently by Ahad Ha'am, fostered a secular vision of a Jewish "spiritual center" in Israel. Unlike Herzl, the founder of political Zionism, Ahad Ha'am strived for Israel to be "a Jewish state and not merely a state of Jews". Advocates of Zionism view it as a national liberation movement for the repatriation of a persecuted people residing as minorities in a variety of nations to their ancestral homeland. Critics of Zionism view it as a colonialist, racist, and exceptionalist ideology that led advocates to violence during Mandatory Palestine, followed by the forced exodus of Palestinians, and the subs…
in scheme: political affiliation
related: anti-anti-semitism